{"text_format":"3","workbook":"xlsx","n_sheets":30,"sheets":["Instructions","Menu","Universal Input Prices","Irr Alfalfa","Irr Canola","Irr Corn","Irr Corn Silage","Irr Cotton","Irr Peanuts","Irr Sorghum","Irr Sorghum Seed","Irr Sorghum Silage","Irr Sorghum Sudangrass","Irr Soybeans","Irr Sunflowers-Confection","Irr Sunflowers-Oilseed","Irr Triticale Silage","Irr Wheat","Irr Other Crop","Dry Canola","Dry Cotton","Dry Sorghum","Dry Sorghum Sudangrass","Dry Sunflowers-Oilseed","Dry Wheat","Dry Other Crop","Break-Even Comparison","Comparative Returns","Irrigation Analysis","Graphs"],"not_rendered":{"charts":2,"images":35,"macros":1,"defined_names":88,"comments":24},"read":"whole","date_system":"1900"}

{"sheet":"Instructions","index":0,"n_rows":59,"n_cols":3,"rows_kept":59,"merged":[[5,9,5,14],[8,2,12,8],[14,1,14,8],[15,0,19,8],[21,0,24,5],[26,1,26,8],[27,0,29,8],[31,0,33,8],[35,0,38,8],[40,1,40,8],[41,0,44,8],[46,1,46,8],[47,0,50,8],[52,1,52,8],[53,0,55,8],[57,1,57,8],[58,0,59,8]]}
[]
["Version 12.17.2015"]
[]
[]
[]
[]
[]
[null,"Contact Us","Irrigation Spreadsheet Project"]
{"$rows_left_out":52}
{"sheet":"Menu","index":1,"n_rows":27,"n_cols":4,"rows_kept":27,"merged":[[2,3,2,9]]}
[]
[]
[null,"Budgets",null,"Analysis Selection"]
[null,{"$f":"'Irr Alfalfa'!$A$3","v":"Irrigated Alfalfa "}]
[null,{"$f":"'Irr Canola'!$A$3","v":"Irrigated Canola"}]
[null,{"$f":"'Irr Corn'!$A$3","v":"Irrigated Corn"}]
[null,{"$f":"'Irr Corn Silage'!$A$3","v":"Irrigated Corn Silage"}]
[null,{"$f":"'Irr Cotton'!$A$3","v":"Irrigated Cotton"}]
{"$rows_left_out":20}
{"sheet":"Universal Input Prices","index":2,"n_rows":46,"n_cols":10,"rows_kept":46}
[]
["Basic Universal Input Prices"]
["Commodity","Price","Unit"]
["Alfalfa",{"v":140,"d":"$140.00"},"ton"]
["Canola",{"v":13.9,"d":"$13.90"},"cwt"]
["Corn",{"v":3.8,"d":"$3.80"},"bu"]
["Corn Silage",{"v":35.1,"d":"$35.10"},"ton"]
["Cotton",{"v":0.65,"d":"$0.6500"},"lb"]
{"$rows_left_out":39}
{"sheet":"Irr Alfalfa","index":3,"n_rows":66,"n_cols":9,"rows_kept":66,"merged":[[1,0,1,7],[2,0,2,7],[3,0,3,7]]}
[]
[" Estimated Costs and Returns per Acre"]
["Irrigated Alfalfa "]
["Projected for 2016"]
[{"$nulls":7},"Rental Agreement","Share"]
["Item ","Quantity","Unit","Price","Landlord"," ",null,"Share","Cash"]
[{"$nulls":4},"Share","Total","Tenant","Landlord"]
["Income"]
{"$rows_left_out":59}
{"sheet":"Irr Canola","index":4,"n_rows":66,"n_cols":9,"rows_kept":66,"merged":[[1,0,1,7],[2,0,2,7],[3,0,3,7]]}
[]
[" Estimated Costs and Returns per Acre"]
["Irrigated Canola"]
["Projected for 2016"]
[{"$nulls":7},"Rental Agreement","Share"]
["Item ","Quantity","Unit","Price","Landlord"," ",null,"Share","Cash"]
[{"$nulls":4},"Share","Total","Tenant","Landlord"]
["Income"]
{"$rows_left_out":59}
{"sheet":"Irr Corn","index":5,"n_rows":64,"n_cols":9,"rows_kept":64,"merged":[[1,0,1,7],[2,0,2,7],[3,0,3,7]]}
[]
[" Estimated Costs and Returns per Acre"]
["Irrigated Corn"]
["Projected for 2016"]
[{"$nulls":7},"Rental Agreement","Share"]
["Item ","Quantity","Unit","Price","Landlord"," ",null,"Cash","Cash"]
[{"$nulls":4},"Share","Total","Tenant","Landlord"]
["Income"]
{"$rows_left_out":57}
{"sheet":"Irr Corn Silage","index":6,"n_rows":64,"n_cols":9,"rows_kept":64,"merged":[[1,0,1,7],[2,0,2,7],[3,0,3,7]]}
[]
[" Estimated Costs and Returns per Acre"]
["Irrigated Corn Silage"]
["Projected for 2016"]
[{"$nulls":7},"Rental Agreement","Share"]
["Item ","Quantity","Unit","Price","Landlord"," ",null,"Share","Cash"]
[{"$nulls":4},"Share","Total","Tenant","Landlord"]
["Income"]
{"$rows_left_out":57}
{"sheet":"Irr Cotton","index":7,"n_rows":69,"n_cols":9,"rows_kept":69,"merged":[[1,0,1,7],[2,0,2,7],[3,0,3,7]]}
[]
[" Estimated Costs and Returns per Acre"]
["Irrigated Cotton"]
["Projected for 2016"]
[{"$nulls":7},"Rental Agreement","Share"]
["Item ","Quantity","Unit","Price","Landlord"," ",null,"Share","Cash"]
[{"$nulls":4},"Share","Total","Tenant","Landlord"]
["Income"]
{"$rows_left_out":62}
{"sheet":"Irr Peanuts","index":8,"n_rows":68,"n_cols":9,"rows_kept":68,"merged":[[1,0,1,7],[2,0,2,7],[3,0,3,7]]}
[]
[" Estimated Costs and Returns per Acre"]
["Irrigated Peanuts"]
["Projected for 2016"]
[{"$nulls":7},"Rental Agreement","Share"]
["Item ","Quantity","Unit","Price","Landlord"," ",null,"Share","Cash"]
[{"$nulls":4},"Share","Total","Tenant","Landlord"]
["Income"]
{"$rows_left_out":61}
{"sheet":"Irr Sorghum","index":9,"n_rows":63,"n_cols":9,"rows_kept":63,"merged":[[1,0,1,7],[2,0,2,7],[3,0,3,7]]}
[]
[" Estimated Costs and Returns per Acre"]
["Irrigated Sorghum"]
["Projected for 2016"]
[{"$nulls":7},"Rental Agreement","Share"]
["Item ","Quantity","Unit","Price","Landlord"," ",null,"Share","Cash"]
[{"$nulls":4},"Share","Total","Tenant","Landlord"]
["Income"]
{"$rows_left_out":56}
{"sheet":"Irr Sorghum Seed","index":10,"n_rows":63,"n_cols":9,"rows_kept":63,"merged":[[1,0,1,7],[2,0,2,7],[3,0,3,7]]}
[]
[" Estimated Costs and Returns per Acre"]
["Irrigated Sorghum Seed "]
["Projected for 2016"]
[{"$nulls":7},"Rental Agreement","Share"]
["Item ","Quantity","Unit","Price","Landlord"," ",null,"Share","Cash"]
[{"$nulls":4},"Share","Total","Tenant","Landlord"]
["Income"]
{"$rows_left_out":56}
{"sheet":"Irr Sorghum Silage","index":11,"n_rows":63,"n_cols":9,"rows_kept":63,"merged":[[1,0,1,7],[2,0,2,7],[3,0,3,7]]}
[]
[" Estimated Costs and Returns per Acre"]
["Irrigated Sorghum Silage"]
["Projected for 2016"]
[{"$nulls":7},"Rental Agreement","Share"]
["Item ","Quantity","Unit","Price","Landlord"," ",null,"Share","Cash"]
[{"$nulls":4},"Share","Total","Tenant","Landlord"]
["Income"]
{"$rows_left_out":56}
{"sheet":"Irr Sorghum Sudangrass","index":12,"n_rows":63,"n_cols":9,"rows_kept":63,"merged":[[1,0,1,7],[2,0,2,7],[3,0,3,7]]}
[]
[" Estimated Costs and Returns per Acre"]
["Irrigated Sorghum Sudangrass"]
["Projected for 2016"]
[{"$nulls":7},"Rental Agreement","Share"]
["Item ","Quantity","Unit","Price","Landlord"," ",null,"Share","Cash"]
[{"$nulls":4},"Share","Total","Tenant","Landlord"]
["Income"]
{"$rows_left_out":56}
{"sheet":"Irr Soybeans","index":13,"n_rows":66,"n_cols":9,"rows_kept":66,"merged":[[1,0,1,7],[2,0,2,7],[3,0,3,7]]}
[]
[" Estimated Costs and Returns per Acre"]
["Irrigated Soybeans"]
["Projected for 2016"]
[{"$nulls":7},"Rental Agreement","Share"]
["Item ","Quantity","Unit","Price","Landlord"," ",null,"Share","Cash"]
[{"$nulls":4},"Share","Total","Tenant","Landlord"]
["Income"]
{"$rows_left_out":59}
{"sheet":"Irr Sunflowers-Confection","index":14,"n_rows":66,"n_cols":9,"rows_kept":66,"merged":[[1,0,1,7],[2,0,2,7],[3,0,3,7]]}
[]
[" Estimated Costs and Returns per Acre"]
["Irrigated Sunflowers-Confectionary "]
["Projected for 2016"]
[{"$nulls":7},"Rental Agreement","Share"]
["Item ","Quantity","Unit","Price","Landlord"," ",null,"Share","Cash"]
[{"$nulls":4},"Share","Total","Tenant","Landlord"]
["Income"]
{"$rows_left_out":59}
{"sheet":"Irr Sunflowers-Oilseed","index":15,"n_rows":65,"n_cols":9,"rows_kept":65,"merged":[[1,0,1,7],[2,0,2,7],[3,0,3,7]]}
[]
[" Estimated Costs and Returns per Acre"]
["Irrigated Sunflowers-Oilseed "]
["Projected for 2016"]
[{"$nulls":7},"Rental Agreement","Share"]
["Item ","Quantity","Unit","Price","Landlord"," ",null,"Share","Cash"]
[{"$nulls":4},"Share","Total","Tenant","Landlord"]
["Income"]
{"$rows_left_out":58}
{"sheet":"Irr Triticale Silage","index":16,"n_rows":63,"n_cols":9,"rows_kept":63,"merged":[[1,0,1,7],[2,0,2,7],[3,0,3,7]]}
[]
[" Estimated Costs and Returns per Acre"]
["Irrigated Triticale Silage"]
["Projected for 2016"]
[{"$nulls":7},"Rental Agreement","Share"]
["Item ","Quantity","Unit","Price","Landlord"," ",null,"Share","Cash"]
[{"$nulls":4},"Share","Total","Tenant","Landlord"]
["Income"]
{"$rows_left_out":56}
{"sheet":"Irr Wheat","index":17,"n_rows":64,"n_cols":9,"rows_kept":64,"merged":[[1,0,1,7],[2,0,2,7],[3,0,3,7]]}
[]
[" Estimated Costs and Returns per Acre"]
["Irrigated Wheat"]
["Projected for 2016"]
[{"$nulls":7},"Rental Agreement","Share"]
["Item ","Quantity","Unit","Price","Landlord"," ",null,"Share","Cash"]
[{"$nulls":4},"Share","Total","Tenant","Landlord"]
["Income"]
{"$rows_left_out":57}
{"sheet":"Irr Other Crop","index":18,"n_rows":65,"n_cols":9,"rows_kept":65,"merged":[[1,0,1,7],[2,0,2,7],[3,0,3,7]]}
[]
[" Estimated Costs and Returns per Acre"]
[{"$f":"'Universal Input Prices'!A19","v":"Irrigated Other Crop"}]
["Projected for 2016"]
[{"$nulls":7},"Rental Agreement","Share"]
["Item ","Quantity","Unit","Price","Landlord"," ",null,"Share","Cash"]
[{"$nulls":4},"Share","Total","Tenant","Landlord"]
["Income"]
{"$rows_left_out":58}
{"sheet":"Dry Canola","index":19,"n_rows":62,"n_cols":9,"rows_kept":62,"merged":[[1,0,1,7],[2,0,2,7],[3,0,3,7]]}
[]
[" Estimated Costs and Returns per Acre"]
["Dryland Canola"]
["Projected for 2016"]
[{"$nulls":7},"Rental Agreement","Share"]
["Item ","Quantity","Unit","Price","Landlord"," ",null,"Share","Cash"]
[{"$nulls":4},"Share","Total","Tenant","Landlord"]
["Income"]
{"$rows_left_out":55}
{"sheet":"Dry Cotton","index":20,"n_rows":66,"n_cols":9,"rows_kept":66,"merged":[[1,0,1,7],[2,0,2,7],[3,0,3,7]]}
[]
[" Estimated Costs and Returns per Acre"]
["Dryland Cotton"]
["Projected for 2016"]
[{"$nulls":7},"Rental Agreement","Share"]
["Item ","Quantity","Unit","Price","Landlord"," ",null,"Share","Cash"]
[{"$nulls":4},"Share","Total","Tenant","Landlord"]
["Income"]
{"$rows_left_out":59}
{"sheet":"Dry Sorghum","index":21,"n_rows":60,"n_cols":9,"rows_kept":60,"merged":[[1,0,1,7],[2,0,2,7],[3,0,3,7]]}
[]
[" Estimated Costs and Returns per Acre"]
["Dryland Sorghum"]
["Projected for 2016"]
[{"$nulls":7},"Rental Agreement","Share"]
["Item ","Quantity","Unit","Price","Landlord"," ",null,"Share","Cash"]
[{"$nulls":4},"Share","Total","Tenant","Landlord"]
["Income"]
{"$rows_left_out":53}
{"sheet":"Dry Sorghum Sudangrass","index":22,"n_rows":59,"n_cols":9,"rows_kept":59,"merged":[[1,0,1,7],[2,0,2,7],[3,0,3,7]]}
[]
[" Estimated Costs and Returns per Acre"]
["Dryland Sorghum Sudangrass"]
["Projected for 2016"]
[{"$nulls":7},"Rental Agreement","Share"]
["Item ","Quantity","Unit","Price","Landlord"," ",null,"Share","Cash"]
[{"$nulls":4},"Share","Total","Tenant","Landlord"]
["Income"]
{"$rows_left_out":52}
{"sheet":"Dry Sunflowers-Oilseed","index":23,"n_rows":61,"n_cols":9,"rows_kept":61,"merged":[[1,0,1,7],[2,0,2,7],[3,0,3,7]]}
[]
[" Estimated Costs and Returns per Acre"]
["Dryland Sunflowers-Oilseed "]
["Projected for 2016"]
[{"$nulls":7},"Rental Agreement","Share"]
["Item ","Quantity","Unit","Price","Landlord"," ",null,"Share","Cash"]
[{"$nulls":4},"Share","Total","Tenant","Landlord"]
["Income"]
{"$rows_left_out":54}
{"sheet":"Dry Wheat","index":24,"n_rows":61,"n_cols":9,"rows_kept":61,"merged":[[1,0,1,7],[2,0,2,7],[3,0,3,7]]}
[]
[" Estimated Costs and Returns per Acre"]
["Dryland Wheat"]
["Projected for 2016"]
[{"$nulls":7},"Rental Agreement","Share"]
["Item ","Quantity","Unit","Price","Landlord"," ",null,"Share","Cash"]
[{"$nulls":4},"Share","Total","Tenant","Landlord"]
["Income"]
{"$rows_left_out":54}
{"sheet":"Dry Other Crop","index":25,"n_rows":61,"n_cols":9,"rows_kept":61,"merged":[[1,0,1,7],[2,0,2,7],[3,0,3,7]]}
[]
[" Estimated Costs and Returns per Acre"]
[{"$f":"'Universal Input Prices'!A20","v":"Dryland Other Crop"}]
["Projected for 2016"]
[{"$nulls":7},"Rental Agreement","Share"]
["Item ","Quantity","Unit","Price","Landlord"," ",null,"Share","Cash"]
[{"$nulls":4},"Share","Total","Tenant","Landlord"]
["Income"]
{"$rows_left_out":54}
{"sheet":"Break-Even Comparison","index":26,"n_rows":210,"n_cols":9,"rows_kept":210,"merged":[[1,0,1,8],[2,0,2,8],[4,0,4,8],[5,4,5,5],[5,6,5,8],[13,0,13,8],[14,4,14,5],[14,6,14,8],[22,0,22,8],[23,4,23,5],[23,6,23,8],[31,0,31,8],[32,4,32,5],[32,6,32,8],[40,0,40,8],[41,4,41,5],[41,6,41,8],[49,0,49,8],[50,4,50,5],[50,6,50,8],[58,0,58,8],[59,4,59,5],[59,6,59,8],[67,0,67,8],[68,4,68,5],[68,6,68,8],[76,0,76,8],[77,4,77,5],[77,6,77,8],[85,0,85,8],[86,4,86,5],[86,6,86,8],[94,0,94,8],[95,4,95,5],[95,6,95,8],[103,0,103,8],[104,4,104,5],[104,6,104,8],[112,0,112,8],[113,4,113,5],[113,6,113,8],[121,0,121,8],[122,4,122,5],[122,6,122,8],[130,0,130,8],[131,4,131,5],[131,6,131,8],[139,0,139,8],[140,4,140,5],[140,6,140,8],[148,0,148,8],[149,4,149,5],[149,6,149,8],[157,0,157,8],[158,4,158,5],[158,6,158,8],[166,0,166,8],[167,4,167,5],[167,6,167,8],[175,0,175,8],[176,4,176,5],[176,6,176,8],[184,0,184,8],[185,4,185,5],[185,6,185,8],[193,0,193,8],[194,4,194,5],[194,6,194,8],[202,0,202,8],[203,4,203,5],[203,6,203,8]]}
[]
["Comparative Break-Even Analysis Projected for 2016"]
[]
[]
[{"$f":"'Irr Alfalfa'!A3:H3","v":"Irrigated Alfalfa "}]
[{"$nulls":4},"BE Price to Cover Variable Costs",null,"BE Price to Cover Total Costs"]
["Yield","TON",null,null,"Total","Tenant","Total","Tenant","Landlord"]
[{"v":0.75,"d":"75%"},{"$f":"'Irr Alfalfa'!$B$9*$A8","v":{"v":4.125,"d":"4.13"}},{"$f":"'Irr Alfalfa'!$B$9*(1-'Irr Alfalfa'!$E$9)*$A8","v":{"v":2.76375,"d":"2.76"}},{"$f":"'Irr Alfalfa'!$B$9*'Irr Alfalfa'!$E$9*$A8","v":{"v":1.36125,"d":"1.36"}},{"$f":"('Irr Alfalfa'!F$48+(B8-B$10)*('Irr Alfalfa'!$D$26))/B8","v":{"v":107.61584465727626,"d":"$107.62"}},{"$f":"('Irr Alfalfa'!G$48+(C8-C$10)*('Irr Alfalfa'!$D$26))/C8","v":{"v":149.54791187280324,"d":"$149.55"}},{"$f":"('Irr Alfalfa'!F$63+(B8-B$10)*('Irr Alfalfa'!$D$26))/B8","v":{"v":174.35523859667018,"d":"$174.36"}},{"$f":"('Irr Alfalfa'!G$63+(C8-C$10)*('Irr Alfalfa'!$D$26))/C8","v":{"v":205.7396803033776,"d":"$205.74"}},{"$f":"IF($D8=0,\"N/A\",('Irr Alfalfa'!H$63+(D8-D$10)*('Irr Alfalfa'!$D$26))/D8)","v":{"v":112.56474269972452,"d":"$112.56"}}]
{"$rows_left_out":203}
{"sheet":"Comparative Returns","index":27,"n_rows":29,"n_cols":25,"rows_kept":29,"merged":[[4,1,4,3],[4,4,4,6],[4,7,4,9],[4,10,4,12],[4,14,4,16],[4,17,4,19],[4,22,4,24]]}
[]
["Comparative Returns"]
["Projected for 2016"]
[]
[null,"Total Revenue",null,null,"Total Variable Costs",null,null,"Return Over Variable Costs",null,null,"Total Costs",{"$nulls":3},"Return Over Variable Costs\nper Acre-Inch Applied",null,null,"Return Over Total Costs",{"$nulls":4},"Break-Even Yield to Cover \nTotal Costs"]
[null,"Total","Tenant","Landlord","Total","Tenant","Landlord","Total","Tenant","Landlord","Total","Tenant","Landlord","ac-in","Total","Tenant","Landlord","Total","Tenant","Landlord","Price","unit","Total","Tenant","Landlord"]
[{"$f":"'Irr Alfalfa'!$A$3:$H$3","v":"Irrigated Alfalfa "},{"$f":"'Irr Alfalfa'!F$12","v":{"v":770,"d":"$770.00"}},{"$f":"'Irr Alfalfa'!G$12","v":{"v":515.9,"d":"$515.90"}},{"$f":"'Irr Alfalfa'!H$12","v":{"v":254.10000000000002,"d":"$254.10"}},{"$f":"'Irr Alfalfa'!F$48","v":{"v":498.91535921126456,"d":"$498.92"}},{"$f":"'Irr Alfalfa'!G$48","v":{"v":450.1630414384599,"d":"$450.16"}},{"$f":"'Irr Alfalfa'!H$48","v":{"v":51.378756,"d":"$51.38"}},{"$f":"B7-E7","v":{"v":271.08464078873544,"d":"$271.08"}},{"$f":"C7-F7","v":{"v":65.73695856154006,"d":"$65.74"}},{"$f":"D7-G7","v":{"v":202.721244,"d":"$202.72"}},{"$f":"'Irr Alfalfa'!F$63","v":{"v":774.2153592112645,"d":"$774.22"}},{"$f":"'Irr Alfalfa'!G$63","v":{"v":605.4630414384599,"d":"$605.46"}},{"$f":"'Irr Alfalfa'!H$63","v":{"v":171.378756,"d":"$171.38"}},{"$f":"'Irr Alfalfa'!B37","v":24},{"$f":"IF($N7=0,\"-\",H7/$N7)","v":{"v":11.29519336619731,"d":"$11.30"}},{"$f":"IF($N7=0,\"-\",I7/$N7)","v":{"v":2.739039940064169,"d":"$2.74"}},{"$f":"IF($N7=0,\"-\",J7/$N7)","v":{"v":8.446718500000001,"d":"$8.45"}},{"$f":"B7-K7","v":{"v":-4.215359211264513,"d":"($4.22)"}},{"$f":"C7-L7","v":{"v":-89.56304143845989,"d":"($89.56)"}},{"$f":"D7-M7","v":{"v":82.72124400000001,"d":"$82.72"}},{"$f":"'Irr Alfalfa'!$D$9","v":{"v":140,"d":"$140.00"}},{"$f":"'Irr Alfalfa'!$C$9","v":"ton"},{"$f":"IF($U7=0, 0, K7/$U7)","v":{"v":5.5301097086518896,"d":"5.5"}},{"$f":"IF($U7=0, 0, IF('Irr Alfalfa'!$E$9=0,0,L7/$U7/(1-'Irr Alfalfa'!$E$9)))","v":{"v":6.4548298660816625,"d":"6.5"}},{"$f":"IF($U7=0, 0, IF('Irr Alfalfa'!$E$9=0,0,M7/$U7/('Irr Alfalfa'!$E$9)))","v":{"v":3.7094968831168833,"d":"3.7"}}]
[{"$f":"'Irr Canola'!$A$3:$H$3","v":"Irrigated Canola"},{"$f":"'Irr Canola'!F$12","v":{"v":305.8,"d":"$305.80"}},{"$f":"'Irr Canola'!G$12","v":{"v":204.886,"d":"$204.89"}},{"$f":"'Irr Canola'!H$12","v":{"v":100.914,"d":"$100.91"}},{"$f":"'Irr Canola'!F$49","v":{"v":284.27470503379925,"d":"$284.27"}},{"$f":"'Irr Canola'!G$49","v":{"v":245.54522746916655,"d":"$245.55"}},{"$f":"'Irr Canola'!H$49","v":{"v":38.20275484646739,"d":"$38.20"}},{"v":21.52529496620076,"d":"$21.53"},{"v":-40.65922746916655,"d":"($40.66)"},{"v":62.71124515353261,"d":"$62.71"},{"$f":"'Irr Canola'!F$63","v":{"v":444.0647050337992,"d":"$444.06"}},{"$f":"'Irr Canola'!G$63","v":{"v":333.3352274691665,"d":"$333.34"}},{"$f":"'Irr Canola'!H$63","v":{"v":110.2027548464674,"d":"$110.20"}},{"$f":"'Irr Canola'!B38","v":10},{"v":2.152529496620076,"d":"$2.15"},{"v":-4.065922746916655,"d":"$4.07"},{"v":6.271124515353261,"d":"$6.27"},{"v":-138.2647050337992,"d":"($138.26)"},{"v":-128.44922746916652,"d":"($128.45)"},{"v":-9.288754846467398,"d":"($9.29)"},{"$f":"'Irr Canola'!$D$9","v":{"v":13.9,"d":"$13.90"}},{"$f":"'Irr Canola'!$C$9","v":"cwt"},{"$f":"IF($U8=0, 0, K8/$U8)","v":{"v":31.947101081568288,"d":"31.9"}},{"$f":"IF($U8=0, 0, IF('Irr Canola'!$E$9=0,0,L8/$U8/(1-'Irr Canola'!$E$9)))","v":{"v":35.79246509923403,"d":"35.8"}},{"$f":"IF($U8=0, 0, IF('Irr Canola'!$E$9=0,0,M8/$U8/('Irr Canola'!$E$9)))","v":{"v":24.025017407121734,"d":"24.0"}}]
{"$rows_left_out":22}
{"sheet":"Irrigation Analysis","index":28,"n_rows":33,"n_cols":23,"rows_kept":33,"merged":[[2,1,2,5],[8,16,8,22]]}
[]
["Irrigation Analysis"]
["Farm Name","ABC Farm"]
["Total Well GPM to Pivot",500]
["Acres Available for Irrigation",120]
["Minimum Planting Circle Size","None"]
["Allowed Inches per Gross Acre",{"v":15,"d":"15.00"}]
["Gross Acres",160]
{"$rows_left_out":26}
{"sheet":"Graphs","index":29,"n_rows":2,"n_cols":1,"rows_kept":2}
[]
["Irrigation Analysis Graphs"]