{"text_format":"3","workbook":"xlsx","n_sheets":30,"sheets":["Instructions","Menu","Universal Input Prices","Irr Alfalfa","Irr Canola","Irr Corn","Irr Corn Silage","Irr Cotton","Irr Peanuts","Irr Sorghum","Irr Sorghum Seed","Irr Sorghum Silage","Irr Sorghum Sudangrass","Irr Soybeans","Irr Sunflowers-Confection","Irr Sunflowers-Oilseed","Irr Triticale Silage","Irr Wheat","Irr Other Crop","Dry Canola","Dry Cotton","Dry Sorghum","Dry Sorghum Sudangrass","Dry Sunflowers-Oilseed","Dry Wheat","Dry Other Crop","Break-Even Comparison","Comparative Returns","Irrigation Analysis","Graphs"],"not_rendered":{"charts":2,"images":35,"macros":1,"defined_names":88,"comments":24},"read":"whole","date_system":"1900"}

{"sheet":"Instructions","index":0,"n_rows":59,"n_cols":3,"rows_kept":59,"merged":[[5,9,5,14],[8,2,12,8],[14,1,14,8],[15,0,19,8],[21,0,24,5],[26,1,26,8],[27,0,29,8],[31,0,33,8],[35,0,38,8],[40,1,40,8],[41,0,44,8],[46,1,46,8],[47,0,50,8],[52,1,52,8],[53,0,55,8],[57,1,57,8],[58,0,59,8]]}
[]
["Version 12.17.2015"]
[]
[]
[]
[]
[]
[null,"Contact Us","Irrigation Spreadsheet Project"]
[null,"Texas Corn Producers","Spreadsheets were developed as part of a project supported by the Texas Corn Producers to create a decision aid that assists irrigated operators in making management decisions on the optimal crop mix for their land. Certain applications utilized were initially created as part of a project funded by the Texas Cotton State Support Committee.   "]
[null,"Extension Ag Economics"]
[null,"Master Marketer"]
[null,"Farm Assistance"]
[null,"Market Outlook"]
[null,"Futures Charts and Prices"]
[null,"Introduction"]
["This tool requires Excel or a similar program that will read an Excel file. Budget cost estimates are not meant to represent any specific farm. They are averages, and serve as a starting point in your analysis.  Due to differences in soil types and other resources that vary from farm to farm, it is important that you enter individualized crop cost estimates to achieve realistic results. To make long run decisions and determine farm business sustainability in future years, you will need to estimate fixed costs as well.  "]
[]
[]
[]
[]
[]
["The FARM Assistance Strategic Planning program is another useful tool for evaluating long term operational viability, and analyzing the financial impact of various business decisions such as acquiring more land or changing crop mixes. Contact DeDe Jones at 677-5600 or                                          for more information."]
[]
[]
[]
[]
[null,"From Sheet to Sheet"]
["Each crop budget (Irr Alfalfa, Irr Corn, etc) and analysis section (Prices, Break-Even, Comparative, Irrigation) is displayed on a separate tab/sheet.  However, summary tables in the analyses portion of this spreadsheet are tied to the budgets by equations, and will immediately update as you make changes to the individual budgets."]
[]
[]
[]
["The Menu sheet provides direct access to all crop budgets and summary pages from one location. It also allows the user to select the crops and scenarios they wish to see in the analyses tabs. To return to the Menu or navigate to the Prices, Break-even, Comparative, or Irrigation sections, use the colored navigation bar at the top of each sheet. "]
[]
[]
[]
["Click on the crop budget name at the bottom of the screen to move from tab to tab. To scroll left or right and get access to budgets not listed on the screen, use the four small triangles in the bottom left corner of the worksheet.  Clicking on one of the triangles with a vertical line will take you to the first sheet or the last sheet.  Clicking on one of the triangles in the center will move over one sheet either left or right."]
[]
[]
[]
[]
[null,"Entering Your Numbers"]
["To enter personalized data in a budget, click on the number in BLUE that you wish to change, type in the new entry and press the Enter key, or just use the mouse to click on the next number that needs changing.  GREEN entries can only be altered in the Universal Input Prices sheet. If the meaning of a certain budget number is unclear, many have a red triangle beside the entry. Moving your mouse over the triangle will provide a more detailed explanation.   "]
[]
[]
[]
[]
[null,"Printing"]
["If visible, click on the printer icon above the screen. It is usually found on the second row from the top.  This should print a copy of the worksheet currently being viewed.  For multiple sheets, select the ones you wish to see by holding down the control key while left-clicking on each sheet/tab. Then, selecting the printer icon will print all chosen sheets.  If the icon is not visible, choose the File menu and then Print from the upper left corner, then follow the same procedures as above.      "]
[]
[]
[]
[]
[null,"Saving Your Work"]
["If you want to keep the numbers entered for future sessions, all files must be saved.  To do this, just click on the Save icon (disk) to replace the original information with your new data.  If the Save icon is not visible, you can also select the File menu and then Save As and give the file a new name.  "]
[]
[]
[]
[null,"Special Thanks"]
["A special thanks goes to the project team of Steve Amosson, Thomas Marek, DeDe Jones, Jay Yates, Bridget Guerrero, and Michelle Jones and the project advisory committee of David Ford, Harold Grall, Tom Moore, and Mark Howard."]

{"sheet":"Menu","index":1,"n_rows":27,"n_cols":4,"rows_kept":27,"merged":[[2,3,2,9]]}
[]
[]
[null,"Budgets",null,"Analysis Selection"]
[null,{"$f":"'Irr Alfalfa'!$A$3","v":"Irrigated Alfalfa "}]
[null,{"$f":"'Irr Canola'!$A$3","v":"Irrigated Canola"}]
[null,{"$f":"'Irr Corn'!$A$3","v":"Irrigated Corn"}]
[null,{"$f":"'Irr Corn Silage'!$A$3","v":"Irrigated Corn Silage"}]
[null,{"$f":"'Irr Cotton'!$A$3","v":"Irrigated Cotton"}]
[null,{"$f":"'Irr Peanuts'!$A$3","v":"Irrigated Peanuts"}]
[null,{"$f":"'Irr Sorghum'!$A$3","v":"Irrigated Sorghum"}]
[null,{"$f":"'Irr Sorghum Seed'!$A$3","v":"Irrigated Sorghum Seed "}]
[null,{"$f":"'Irr Sorghum Silage'!$A$3","v":"Irrigated Sorghum Silage"}]
[null,{"$f":"'Irr Sorghum Sudangrass'!$A$3","v":"Irrigated Sorghum Sudangrass"}]
[null,{"$f":"'Irr Soybeans'!$A$3","v":"Irrigated Soybeans"}]
[null,{"$f":"'Irr Sunflowers-Confection'!$A$3","v":"Irrigated Sunflowers-Confectionary "}]
[null,{"$f":"'Irr Sunflowers-Oilseed'!$A$3","v":"Irrigated Sunflowers-Oilseed "}]
[null,{"$f":"'Irr Triticale Silage'!$A$3","v":"Irrigated Triticale Silage"}]
[null,{"$f":"'Irr Wheat'!$A$3","v":"Irrigated Wheat"}]
[null,{"$f":"'Irr Other Crop'!$A$3","v":"Irrigated Other Crop"}]
[]
[null,{"$f":"'Dry Canola'!$A$3","v":"Dryland Canola"}]
[null,{"$f":"'Dry Cotton'!$A$3","v":"Dryland Cotton"}]
[null,{"$f":"'Dry Sorghum'!$A$3","v":"Dryland Sorghum"}]
[null,{"$f":"'Dry Sorghum Sudangrass'!$A$3","v":"Dryland Sorghum Sudangrass"}]
[null,{"$f":"'Dry Sunflowers-Oilseed'!$A$3","v":"Dryland Sunflowers-Oilseed "}]
[null,{"$f":"'Dry Wheat'!$A$3","v":"Dryland Wheat"}]
[null,{"$f":"'Dry Other Crop'!$A$3","v":"Dryland Other Crop"}]

{"sheet":"Universal Input Prices","index":2,"n_rows":46,"n_cols":10,"rows_kept":46}
[]
["Basic Universal Input Prices"]
["Commodity","Price","Unit"]
["Alfalfa",{"v":140,"d":"$140.00"},"ton"]
["Canola",{"v":13.9,"d":"$13.90"},"cwt"]
["Corn",{"v":3.8,"d":"$3.80"},"bu"]
["Corn Silage",{"v":35.1,"d":"$35.10"},"ton"]
["Cotton",{"v":0.65,"d":"$0.6500"},"lb"]
["Cottonseed",{"v":200,"d":"$200.00"},"ton"]
["Peanuts",{"v":420,"d":"$420.00"},"ton"]
["Sorghum",{"v":5.75,"d":"$5.75"},"cwt"]
["Sorghum Seed",{"v":16.9,"d":"$16.90"},"cwt"]
["Sorghum Silage",{"v":31.6,"d":"$31.60"},"ton"]
["Soybeans",{"v":8.4,"d":"$8.40"},"bu"]
["Sunflower - Conf. (large)",{"v":21,"d":"$21.00"},"cwt"]
["Sunflower - Oil",{"v":16.5,"d":"$16.50"},"cwt"]
["Triticale Silage",{"v":31.6,"d":"$31.60"},"ton"]
["Wheat",{"v":3.95,"d":"$3.95"},"bu"]
["Irrigated Other Crop",0,"unit"]
["Dryland Other Crop",0,"unit"]
[]
["Grazing",{"v":0.4,"d":"$0.40"},"lb of gain"]
[]
["Input Item","Price","Unit",null,"Fertilizer Worksheet"]
["Fertilizer",{"$nulls":8},"Cost per ton"]
["fert (N) - dry",{"$f":"J26/I26/2000","v":{"v":0.33043478260869563,"d":"$0.330"}},"/lb of N",null,"% N in Primary Nitrogen Fertilizer - dry",{"$nulls":3},{"v":0.46,"d":"46.0%"},{"v":304,"d":"$304.00"}]
["fert (N) - liquid",{"v":0.41015625,"d":"$0.410"},"/lb of N",null,"% N in Primary Nitrogen Fertilizer - liquid",{"$nulls":3},{"v":0.32,"d":"32.0%"},{"v":262.5,"d":"$262.50"}]
["fert (N) - NH3 ",{"$f":"J28/I28/2000","v":{"v":0.25000000000000006,"d":"$0.250"}},"/lb of N",null,"% N in Primary Nitrogen Fertilizer - NH3",{"$nulls":3},{"v":0.82,"d":"82.0%"},{"v":410,"d":"$410.00"}]
["fert (P) - dry",{"$f":"J29/I29/2000","v":{"v":0.42980769230769234,"d":"$0.430"}},"/lb of P",null,"% P in Primary Phosphate Fertilizer - dry",{"$nulls":3},{"v":0.52,"d":"52.0%"},{"v":447,"d":"$447.00"}]
["fert (P) - liquid",{"$f":"J30/I30/2000","v":{"v":0.47,"d":"$0.470"}},"/lb of P",null,"% P in Primary Phosphate Fertilizer - liquid",{"$nulls":3},{"v":0.34,"d":"34.0%"},{"v":319.6,"d":"$319.60"}]
["Labor",{"v":12.45,"d":"$12.45"},"/hour"]
["Diesel Fuel - Tractors",{"v":1.81,"d":"$1.81"},"/gallon"]
["Gasoline - Pickup",{"v":1.926,"d":"$1.93"},"/gallon"]
["Irrigation Fuel",{"v":3.6,"d":"$3.60"},"/acre inch"]
["Interest-operating capital",{"v":0.054,"d":"5.40%"},"APR"]
["Cotton"]
["Stripping & module",{"v":8,"d":"$8.000"},"/cwt cotton lint"]
["Ginning",{"v":2.75,"d":"$2.75"},"/cwt seed cotton"]
["Seed Turnout",750,"lbs/500 lb bale",null," "]
[{"$nulls":4}," "]
[{"$nulls":4}," "]
[]
[]
[]
[]
[{"$nulls":4}," "]

{"sheet":"Irr Alfalfa","index":3,"n_rows":66,"n_cols":9,"rows_kept":66,"merged":[[1,0,1,7],[2,0,2,7],[3,0,3,7]]}
[]
[" Estimated Costs and Returns per Acre"]
["Irrigated Alfalfa "]
["Projected for 2016"]
[{"$nulls":7},"Rental Agreement","Share"]
["Item ","Quantity","Unit","Price","Landlord"," ",null,"Share","Cash"]
[{"$nulls":4},"Share","Total","Tenant","Landlord"]
["Income"]
["alfalfa hay",{"v":5.5,"d":"5.50"},"ton",{"$f":"'Universal Input Prices'!B4","v":{"v":140,"d":"$140.00"}},{"v":0.33,"d":"33%"},{"$f":"D9*B9","v":{"v":770,"d":"$770.00"}},{"$f":"F9*(1-E9)","v":{"v":515.9,"d":"$515.90"}},{"$f":"IF(H6=\"Cash\", D58,F9*E9)","v":{"v":254.10000000000002,"d":"$254.10"}}]
["other income",{"v":0,"d":"0.00"},"$/ac.",{"v":1,"d":"$1.00"},{"v":0.33,"d":"33%"},{"$f":"D10*B10","v":{"v":0,"d":"$0.00"}},{"$f":"F10*(1-E10)","v":{"v":0,"d":"$0.00"}},{"$f":"IF(H7=\"Cash\", D59,F10*E10)","v":{"v":0,"d":"$0.00"}}]
[]
["Total Income",{"$nulls":4},{"$f":"SUM(F8:F11)","v":{"v":770,"d":"$770.00"}},{"$f":"SUM(G8:G11)","v":{"v":515.9,"d":"$515.90"}},{"$f":"SUM(H8:H11)","v":{"v":254.10000000000002,"d":"$254.10"}}]
[]
["Variable Costs"]
["Seed"]
["alfalfa",{"v":0,"d":"0.00"},"lb",{"v":5.65,"d":"$5.65"},{"v":0,"d":"0%"},{"$f":"D16*B16","v":{"v":0,"d":"$0.00"}},{"$f":"F16*(1-E16)","v":{"v":0,"d":"$0.00"}},{"$f":"F16*E16","v":{"v":0,"d":"$0.00"}}]
["Fertilizer"]
["fert (P) - liquid",{"v":60,"d":"60.0"},"lb",{"$f":"IF(A18=\"\",0,VLOOKUP(A18,'Universal Input Prices'!$A$26:$B$30, 2))","v":{"v":0.47,"d":"$0.470"}},{"v":0.33,"d":"33%"},{"$f":"D18*B18","v":{"v":28.2,"d":"$28.20"}},{"$f":"F18*(1-E18)","v":{"v":18.894,"d":"$18.89"}},{"$f":"F18*E18","v":{"v":9.306000000000001,"d":"$9.31"}}]
[null,{"v":0,"d":"0.0"},"lb",{"$f":"IF(A19=\"\",0,VLOOKUP(A19,'Universal Input Prices'!$A$26:$B$30, 2))","v":{"v":0,"d":"$0.000"}},{"v":0,"d":"0%"},{"$f":"D19*B19","v":{"v":0,"d":"$0.00"}},{"$f":"F19*(1-E19)","v":{"v":0,"d":"$0.00"}},{"$f":"F19*E19","v":{"v":0,"d":"$0.00"}}]
[null,{"v":0,"d":"0.0"},"lb",{"$f":"IF(A20=\"\",0,VLOOKUP(A20,'Universal Input Prices'!$A$26:$B$30, 2))","v":{"v":0,"d":"$0.000"}},{"v":0,"d":"0%"},{"$f":"D20*B20","v":{"v":0,"d":"$0.00"}},{"$f":"F20*(1-E20)","v":{"v":0,"d":"$0.00"}},{"$f":"F20*E20","v":{"v":0,"d":"$0.00"}}]
["sulfur",{"v":0,"d":"0.0"},"lb",{"v":0.12,"d":"$0.12"},{"v":0.33,"d":"33%"},{"$f":"D21*B21","v":{"v":0,"d":"$0.00"}},{"$f":"F21*(1-E21)","v":{"v":0,"d":"$0.00"}},{"$f":"F21*E21","v":{"v":0,"d":"$0.00"}}]
["Field Operations"]
["herbicide & application",{"v":1,"d":"1.0"},"acre",{"v":22,"d":"$22.00"},{"v":0.33,"d":"33%"},{"$f":"D23*B23","v":{"v":22,"d":"$22.00"}},{"$f":"F23*(1-E23)","v":{"v":14.739999999999998,"d":"$14.74"}},{"$f":"F23*E23","v":{"v":7.260000000000001,"d":"$7.26"}}]
["fertilizer application",{"v":1,"d":"1.0"},"acre",{"v":5,"d":"$5.00"},{"v":0.33,"d":"33%"},{"$f":"D24*B24","v":{"v":5,"d":"$5.00"}},{"$f":"F24*(1-E24)","v":{"v":3.3499999999999996,"d":"$3.35"}},{"$f":"F24*E24","v":{"v":1.6500000000000001,"d":"$1.65"}}]
["insecticide & application",{"v":1,"d":"1.0"},"acre",{"v":10,"d":"$10.00"},{"v":0.33,"d":"33%"},{"$f":"D25*B25","v":{"v":10,"d":"$10.00"}},{"$f":"F25*(1-E25)","v":{"v":6.699999999999999,"d":"$6.70"}},{"$f":"F25*E25","v":{"v":3.3000000000000003,"d":"$3.30"}}]
["custom baling",{"$f":"$B$9","v":{"v":5.5,"d":"5.50"}},"ton",{"v":40,"d":"$40.00"},{"v":0,"d":"0%"},{"$f":"D26*B26","v":{"v":220,"d":"$220.00"}},{"$f":"F26*(1-E26)","v":{"v":220,"d":"$220.00"}},{"$f":"F26*E26","v":{"v":0,"d":"$0.00"}}]
["crop consultant",{"v":1,"d":"1.0"},"acre",{"v":0,"d":"$0.00"},{"v":0,"d":"0%"},{"$f":"D27*B27","v":{"v":0,"d":"$0.00"}},{"$f":"F27*(1-E27)","v":{"v":0,"d":"$0.00"}},{"$f":"F27*E27","v":{"v":0,"d":"$0.00"}}]
["scouting",{"v":1,"d":"1.0"},"acre",{"v":0,"d":"$0.00"},{"v":0,"d":"0%"},{"v":0,"d":"$0.00"},{"v":0,"d":"$0.00"},{"v":0,"d":"$0.00"}]
["other ",{"v":1,"d":"1.0"},"acre",{"v":0,"d":"$0.00"},{"v":0,"d":"0%"},{"v":0,"d":"$0.00"},{"v":0,"d":"$0.00"},{"v":0,"d":"$0.00"}]
["other ",{"v":1,"d":"1.0"},"acre",{"v":0,"d":"$0.00"},{"v":0,"d":"0%"},{"v":0,"d":"$0.00"},{"v":0,"d":"$0.00"},{"v":0,"d":"$0.00"}]
["other ",{"v":1,"d":"1.0"},"acre",{"v":0,"d":"$0.00"},{"v":0,"d":"0%"},{"v":0,"d":"$0.00"},{"v":0,"d":"$0.00"},{"v":0,"d":"$0.00"}]
["Crop Insurance",{"v":1,"d":"1.0"},"acre",{"v":0,"d":"$0.00"},{"v":0,"d":"0%"},{"v":0,"d":"$0.00"},{"v":0,"d":"$0.00"},{"v":0,"d":"$0.00"}]
["Operator Labor & Hand Labor",{"v":0,"d":"0.00"},"hour",{"$f":"'Universal Input Prices'!$B$31","v":{"v":12.45,"d":"$12.45"}},{"v":0,"d":"0%"},{"v":0,"d":"$0.00"},{"v":0,"d":"$0.00"},{"v":0,"d":"$0.00"}]
["Irrigation Labor",{"v":1.536,"d":"1.54"},"hours",{"$f":"'Universal Input Prices'!$B$31","v":{"v":12.45,"d":"$12.45"}},{"v":0,"d":"0%"},{"v":19.1232,"d":"$19.12"},{"v":19.1232,"d":"$19.12"},{"v":0,"d":"$0.00"}]
["Diesel Fuel - Tractors",{"v":0,"d":"0.00"},"gallons",{"$f":"'Universal Input Prices'!$B$32","v":{"v":1.81,"d":"$1.81"}},{"v":0,"d":"0%"},{"v":0,"d":"$0.00"},{"v":0,"d":"$0.00"},{"v":0,"d":"$0.00"}]
["Gasoline - Pickup",{"v":2.04923,"d":"2.05"},"gallons",{"$f":"'Universal Input Prices'!$B$33","v":{"v":1.926,"d":"$1.93"}},{"v":0,"d":"0%"},{"v":3.94681698,"d":"$3.95"},{"v":3.94681698,"d":"$3.95"},{"v":0,"d":"$0.00"}]
["Irrigation Fuel",{"v":24,"d":"24.00"},"acin",{"$f":"'Universal Input Prices'!$B$34","v":{"v":3.6,"d":"$3.60"}},{"v":0.33,"d":"33%"},{"$f":"D37*B37","v":{"v":86.4,"d":"$86.40"}},{"$f":"F37*(1-E37)","v":{"v":57.888,"d":"$57.89"}},{"$f":"F37*E37","v":{"v":28.512000000000004,"d":"$28.51"}}]
["Pumping Days",56.57]
["Calculated GPM capacity per acre needed",{"$f":"B37*18.85694/B38","v":{"v":8.000115962524307,"d":"8.00"}}]
["Repair & Maintenance"]
["Implements",{"v":1,"d":"1.00"},"acre",{"v":0,"d":"$0.00"},{"v":0,"d":"0%"},{"$f":"D41*B41","v":{"v":0,"d":"$0.00"}},{"$f":"F41*(1-E41)","v":{"v":0,"d":"$0.00"}},{"$f":"F41*E41","v":{"v":0,"d":"$0.00"}}]
["Tractors",{"v":1,"d":"1.00"},"acre",{"v":0,"d":"$0.00"},{"v":0,"d":"0%"},{"$f":"D42*B42","v":{"v":0,"d":"$0.00"}},{"$f":"F42*(1-E42)","v":{"v":0,"d":"$0.00"}},{"$f":"F42*E42","v":{"v":0,"d":"$0.00"}}]
["Irrigation-Above Ground",{"$f":"B37","v":{"v":24,"d":"24.00"}},"acin",{"v":4.04,"d":"$4.04"},{"v":0,"d":"0%"},{"$f":"D43*B43","v":{"v":96.96000000000001,"d":"$96.96"}},{"$f":"F43*(1-E43)","v":{"v":96.96000000000001,"d":"$96.96"}},{"$f":"F43*E43","v":{"v":0,"d":"$0.00"}}]
["Self Propelled Equipment",{"v":1,"d":"1.00"},"acre",{"v":0,"d":"$0.00"},{"v":1,"d":"100%"},{"$f":"D44*B44","v":{"v":0,"d":"$0.00"}},{"$f":"F44*(1-E44)","v":{"v":0,"d":"$0.00"}},{"$f":"F44*E44","v":{"v":0,"d":"$0.00"}}]
["Pickup",{"v":1,"d":"1.00"},"acre",{"v":2.51,"d":"$2.51"},{"v":0,"d":"0%"},{"$f":"D45*B45","v":{"v":2.51,"d":"$2.51"}},{"$f":"F45*(1-E45)","v":{"v":2.51,"d":"$2.51"}},{"$f":"F45*E45","v":{"v":0,"d":"$0.00"}}]
["Interest-operating capital",{"$f":"'Universal Input Prices'!$B$35","v":{"v":0.054,"d":"5.40%"}},{"$nulls":3},{"$f":"(SUM(F16:F25,F27:F45))*$B46/3.1","v":{"v":4.775342231264517,"d":"$4.78"}},{"$f":"(SUM(G16:G25,G27:G45))*$B46/2","v":{"v":6.05102445846,"d":"$6.05"}},{"v":1.350756,"d":"$1.35"}]
[]
["Total Variable Costs",{"$nulls":4},{"$f":"SUM(F16:F47)","v":{"v":498.91535921126456,"d":"$498.92"}},{"$f":"SUM(G16:G46)","v":{"v":450.1630414384599,"d":"$450.16"}},{"$f":"SUM(H16:H46)","v":{"v":51.378756,"d":"$51.38"}}]
["Returns Above Variable Costs",{"$nulls":4},{"$f":"F12-F48","v":{"v":271.08464078873544,"d":"$271.08"}},{"$f":"G12-G48","v":{"v":65.73695856154006,"d":"$65.74"}},{"$f":"H12-H48","v":{"v":202.721244,"d":"$202.72"}}]
[]
["Fixed Costs"]
["Implements",{"v":1,"d":"1.00"},"acre",{"v":0,"d":"$0.00"},{"v":0,"d":"0%"},{"$f":"D52*B52","v":{"v":0,"d":"$0.00"}},{"$f":"F52*(1-E52)","v":{"v":0,"d":"$0.00"}},{"$f":"F52*E52","v":{"v":0,"d":"$0.00"}}]
["Tractors",{"v":1,"d":"1.00"},"acre",{"v":0,"d":"$0.00"},{"v":0,"d":"0%"},{"v":0,"d":"$0.00"},{"v":0,"d":"$0.00"},{"v":0,"d":"$0.00"}]
["Irrigation Equipment",{"v":1,"d":"1.00"},"acre",{"v":47.34,"d":"$47.34"},{"v":0,"d":"0%"},{"v":47.34,"d":"$47.34"},{"v":47.34,"d":"$47.34"},{"v":0,"d":"$0.00"}]
["Self Propelled Equipment",{"v":1,"d":"1.00"},"acre",{"v":0,"d":"$0.00"},{"v":1,"d":"100%"},{"v":0,"d":"$0.00"},{"v":0,"d":"$0.00"},{"v":0,"d":"$0.00"}]
["Pickup",{"v":1,"d":"1.00"},"acre",{"v":3.66,"d":"$3.66"},{"v":0,"d":"0%"},{"v":3.66,"d":"$3.66"},{"v":3.66,"d":"$3.66"},{"v":0,"d":"$0.00"}]
["Management",{"v":1,"d":"1.00"},"acre",{"v":0,"d":"$0.00"},{"v":0,"d":"0%"},{"v":0,"d":"$0.00"},{"v":0,"d":"$0.00"},{"v":0,"d":"$0.00"}]
["Irrigation Investment",{"v":1,"d":"1.00"},"acre",{"v":32.3,"d":"$32.30"},{"v":0,"d":"0%"},{"v":32.3,"d":"$32.30"},{"v":32.3,"d":"$32.30"},{"v":0,"d":"$0.00"}]
["Land",{"v":1,"d":"1.00"},"acre",{"v":120,"d":"$120.00"},{"v":1,"d":"100%"},{"v":120,"d":"$120.00"},{"$f":"IF($H$6=\"Cash\",D59,F59*(1-E59))","v":{"v":0,"d":"$0.00"}},{"$f":"IF($H$6=\"Cash\",0,F59*E59)","v":{"v":120,"d":"$120.00"}}]
["Property Tax",{"v":1,"d":"1.00"},"acre",{"v":0,"d":"$0.00"},{"v":1,"d":"100%"},{"v":0,"d":"$0.00"},{"v":0,"d":"$0.00"},{"v":0,"d":"$0.00"}]
["Perenial Crop Establishment",{"v":1,"d":"1.00"},"acre",{"v":72,"d":"$72.00"},{"v":0,"d":"0%"},{"$f":"B61*D61","v":{"v":72,"d":"$72.00"}},{"$f":"F61*(1-E61)","v":{"v":72,"d":"$72.00"}},{"$f":"F61*E61","v":{"v":0,"d":"$0.00"}}]
["Total Fixed Costs",{"$nulls":4},{"$f":"SUM(F52:F61)","v":{"v":275.3,"d":"$275.30"}},{"$f":"SUM(G52:G61)","v":{"v":155.3,"d":"$155.30"}},{"$f":"SUM(H52:H61)","v":{"v":120,"d":"$120.00"}}]
["Total Specified Costs",{"$nulls":4},{"$f":"F48+F62","v":{"v":774.2153592112645,"d":"$774.22"}},{"$f":"G48+G62","v":{"v":605.4630414384599,"d":"$605.46"}},{"$f":"H48+H62","v":{"v":171.378756,"d":"$171.38"}}]
["Returns Above Total Specified Costs",{"$nulls":4},{"$f":"F12-F63","v":{"v":-4.215359211264513,"d":"($4.22)"}},{"$f":"G12-G63","v":{"v":-89.56304143845989,"d":"($89.56)"}},{"$f":"H12-H63","v":{"v":82.72124400000001,"d":"$82.72"}}]
[]
["Return on Investment",{"$nulls":4},{"$f":"(F64/F63)","v":{"v":-5.4446855918215435E-3,"d":"-0.54%"}},{"$f":"(G64/G63)","v":{"v":-0.1479248695769702,"d":"-14.79%"}},{"v":0.4826808522288492,"d":"48.27%"}]

{"sheet":"Irr Canola","index":4,"n_rows":66,"n_cols":9,"rows_kept":66,"merged":[[1,0,1,7],[2,0,2,7],[3,0,3,7]]}
[]
[" Estimated Costs and Returns per Acre"]
["Irrigated Canola"]
["Projected for 2016"]
[{"$nulls":7},"Rental Agreement","Share"]
["Item ","Quantity","Unit","Price","Landlord"," ",null,"Share","Cash"]
[{"$nulls":4},"Share","Total","Tenant","Landlord"]
["Income"]
["canola",{"v":22,"d":"22.00"},"cwt",{"$f":"'Universal Input Prices'!$B$5","v":{"v":13.9,"d":"$13.90"}},{"v":0.33,"d":"33%"},{"$f":"D9*B9","v":{"v":305.8,"d":"$305.80"}},{"$f":"F9*(1-E9)","v":{"v":204.886,"d":"$204.89"}},{"$f":"IF(H6=\"Cash\", D60,F9*E9)","v":{"v":100.914,"d":"$100.91"}}]
["other income",{"v":0,"d":"0.00"},"$/ac.",{"v":1,"d":"$1.00"},{"v":0.33,"d":"33%"},{"$f":"D10*B10","v":{"v":0,"d":"$0.00"}},{"$f":"F10*(1-E10)","v":{"v":0,"d":"$0.00"}},{"$f":"IF(H7=\"Cash\", D59,F10*E10)","v":{"v":0,"d":"$0.00"}}]
[]
["Total Income",{"$nulls":4},{"$f":"SUM(F8:F11)","v":{"v":305.8,"d":"$305.80"}},{"$f":"SUM(G8:G11)","v":{"v":204.886,"d":"$204.89"}},{"$f":"SUM(H8:H11)","v":{"v":100.914,"d":"$100.91"}}]
[]
["Variable Costs"]
["Seed"]
["canola seed",{"v":5,"d":"5.00"},"lb",{"v":6.6,"d":"$6.600"},{"v":0,"d":"0%"},{"$f":"D16*B16","v":{"v":33,"d":"$33.00"}},{"$f":"F16*(1-E16)","v":{"v":33,"d":"$33.00"}},{"$f":"F16*E16","v":{"v":0,"d":"$0.00"}}]
["seed treatment",{"v":1,"d":"1.00"},"acre",{"v":6.7,"d":"$6.700"},{"v":0,"d":"0%"},{"$f":"D17*B17","v":{"v":6.7,"d":"$6.70"}},{"$f":"F17*(1-E17)","v":{"v":6.7,"d":"$6.70"}},{"$f":"F17*E17","v":{"v":0,"d":"$0.00"}}]
["Fertilizer"]
["fert (N) - dry",{"v":30,"d":"30.0"},"lb",{"$f":"IF(A19=\"\",0,VLOOKUP(A19,'Universal Input Prices'!$A$26:$B$26, 2))","v":{"v":0.33043478260869563,"d":"$0.330"}},{"v":0.33,"d":"33%"},{"$f":"D19*B19","v":{"v":9.91304347826087,"d":"$9.91"}},{"$f":"F19*(1-E19)","v":{"v":6.6417391304347815,"d":"$6.64"}},{"$f":"F19*E19","v":{"v":3.271304347826087,"d":"$3.27"}}]
["fert (N) - liquid",{"v":60,"d":"60.0"},"lb",{"$f":"IF(A20=\"\",0,VLOOKUP(A20,'Universal Input Prices'!$A$26:$B$27, 2))","v":{"v":0.41015625,"d":"$0.410"}},{"v":0.33,"d":"33%"},{"$f":"D20*B20","v":{"v":24.609375,"d":"$24.61"}},{"$f":"F20*(1-E20)","v":{"v":16.48828125,"d":"$16.49"}},{"$f":"F20*E20","v":{"v":8.12109375,"d":"$8.12"}}]
[null,{"v":0,"d":"0.0"},"lb",{"$f":"IF(A21=\"\",0,VLOOKUP(A21,'Universal Input Prices'!$A$26:$B$30, 2))","v":{"v":0,"d":"$0.000"}},{"v":0,"d":"0%"},{"$f":"D21*B21","v":{"v":0,"d":"$0.00"}},{"$f":"F21*(1-E21)","v":{"v":0,"d":"$0.00"}},{"$f":"F21*E21","v":{"v":0,"d":"$0.00"}}]
["Field Operations"]
["herbicide & application",{"v":1,"d":"1.0"},"acre",{"v":14.3,"d":"$14.30"},{"v":0.33,"d":"33%"},{"$f":"D23*B23","v":{"v":14.3,"d":"$14.30"}},{"$f":"F23*(1-E23)","v":{"v":9.581,"d":"$9.58"}},{"$f":"F23*E23","v":{"v":4.719,"d":"$4.72"}}]
["fertilizer application",{"v":1,"d":"1.0"},"acre",{"v":5,"d":"$5.00"},{"v":0.33,"d":"33%"},{"v":5,"d":"$5.00"},{"v":3.3499999999999996,"d":"$3.35"},{"v":1.6500000000000001,"d":"$1.65"}]
["insecticide & application",{"v":1,"d":"1.0"},"acre",{"v":22.9,"d":"$22.90"},{"v":0.33,"d":"33%"},{"v":22.9,"d":"$22.90"},{"v":15.342999999999998,"d":"$15.34"},{"v":7.5569999999999995,"d":"$7.56"}]
["custom harvest & haul",{"v":1,"d":"1.0"},"acre",{"v":26.75,"d":"$26.75"},{"v":0,"d":"0%"},{"v":26.75,"d":"$26.75"},{"v":26.75,"d":"$26.75"},{"v":0,"d":"$0.00"}]
["custom harvest & haul",{"$f":"B9","v":{"v":22,"d":"22.00"}},"cwt",{"v":0.45,"d":"$0.45"},{"v":0,"d":"0%"},{"v":9.9,"d":"$9.90"},{"v":9.9,"d":"$9.90"},{"v":0,"d":"$0.00"}]
["hoeing",{"v":0,"d":"0.0"},"acre",{"v":0,"d":"$0.00"},{"v":0,"d":"0%"},{"v":0,"d":"$0.00"},{"v":0,"d":"$0.00"},{"v":0,"d":"$0.00"}]
["scouting",{"v":1,"d":"1.0"},"acre",{"v":0,"d":"$0.00"},{"v":0,"d":"0%"},{"v":0,"d":"$0.00"},{"v":0,"d":"$0.00"},{"v":0,"d":"$0.00"}]
["other ",{"v":1,"d":"1.0"},"acre",{"v":0,"d":"$0.00"},{"v":0,"d":"0%"},{"v":0,"d":"$0.00"},{"v":0,"d":"$0.00"},{"v":0,"d":"$0.00"}]
["other ",{"v":1,"d":"1.0"},"acre",{"v":0,"d":"$0.00"},{"v":0,"d":"0%"},{"v":0,"d":"$0.00"},{"v":0,"d":"$0.00"},{"v":0,"d":"$0.00"}]
["other ",{"v":1,"d":"1.0"},"acre",{"v":0,"d":"$0.00"},{"v":0,"d":"0%"},{"v":0,"d":"$0.00"},{"v":0,"d":"$0.00"},{"v":0,"d":"$0.00"}]
["Crop Insurance",{"v":1,"d":"1.0"},"acre",{"v":0,"d":"$0.00"},{"v":0.33,"d":"33%"},{"v":0,"d":"$0.00"},{"v":0,"d":"$0.00"},{"v":0,"d":"$0.00"}]
["Operator Labor & Hand Labor",1.04,"hours",{"$f":"'Universal Input Prices'!$B$31","v":{"v":12.45,"d":"$12.45"}},{"v":0,"d":"0%"},{"v":12.948,"d":"$12.95"},{"v":12.948,"d":"$12.95"},{"v":0,"d":"$0.00"}]
["Irrigation Labor",0.64,"hours",{"$f":"'Universal Input Prices'!$B$31","v":{"v":12.45,"d":"$12.45"}},{"v":0,"d":"0%"},{"v":7.968,"d":"$7.97"},{"v":7.968,"d":"$7.97"},{"v":0,"d":"$0.00"}]
["Diesel Fuel - Tractors",2.65,"gallons",{"$f":"'Universal Input Prices'!$B$32","v":{"v":1.81,"d":"$1.81"}},{"v":0,"d":"0%"},{"v":4.7965,"d":"$4.80"},{"v":4.7965,"d":"$4.80"},{"v":0,"d":"$0.00"}]
["Gasoline - Pickup",{"v":2.04923,"d":"2.05"},"gallons",{"$f":"'Universal Input Prices'!$B$33","v":{"v":1.926,"d":"$1.93"}},{"v":0,"d":"0%"},{"v":3.94681698,"d":"$3.95"},{"v":3.94681698,"d":"$3.95"},{"v":0,"d":"$0.00"}]
["Irrigation Fuel",{"v":10,"d":"10.00"},"acin",{"$f":"'Universal Input Prices'!$B$34","v":{"v":3.6,"d":"$3.60"}},{"v":0.33,"d":"33%"},{"v":36,"d":"$36.00"},{"v":24.119999999999997,"d":"$24.12"},{"v":11.88,"d":"$11.88"}]
["Pumping Days",94.28]
["Calculated GPM capacity per acre needed",{"$f":"B38*18.85694/B39","v":{"v":2.000099703012304,"d":"2.00"}}]
["Repair & Maintenance"]
["Implements",{"v":1,"d":"1.00"},"acre",{"v":10.96,"d":"$10.96"},{"v":0,"d":"0%"},{"$f":"D42*B42","v":{"v":10.96,"d":"$10.96"}},{"$f":"F42*(1-E42)","v":{"v":10.96,"d":"$10.96"}},{"$f":"F42*E42","v":{"v":0,"d":"$0.00"}}]
["Tractors",{"v":1,"d":"1.00"},"acre",{"v":4.65,"d":"$4.65"},{"v":0,"d":"0%"},{"$f":"D43*B43","v":{"v":4.65,"d":"$4.65"}},{"$f":"F43*(1-E43)","v":{"v":4.65,"d":"$4.65"}},{"$f":"F43*E43","v":{"v":0,"d":"$0.00"}}]
["Irrigation-Above Ground",{"$f":"B38","v":{"v":10,"d":"10.00"}},"acin",{"v":4.04,"d":"$4.04"},{"v":0,"d":"0%"},{"$f":"D44*B44","v":{"v":40.4,"d":"$40.40"}},{"$f":"F44*(1-E44)","v":{"v":40.4,"d":"$40.40"}},{"$f":"F44*E44","v":{"v":0,"d":"$0.00"}}]
["Self Propelled Equipment",{"v":1,"d":"1.00"},"acre",{"v":0,"d":"$0.00"},{"v":1,"d":"100%"},{"$f":"D45*B45","v":{"v":0,"d":"$0.00"}},{"$f":"F45*(1-E45)","v":{"v":0,"d":"$0.00"}},{"$f":"F45*E45","v":{"v":0,"d":"$0.00"}}]
["Pickup",{"v":1,"d":"1.00"},"acre",{"v":2.51,"d":"$2.51"},{"v":0,"d":"0%"},{"$f":"D46*B46","v":{"v":2.51,"d":"$2.51"}},{"$f":"F46*(1-E46)","v":{"v":2.51,"d":"$2.51"}},{"$f":"F46*E46","v":{"v":0,"d":"$0.00"}}]
["Interest-operating capital",{"$f":"'Universal Input Prices'!$B$35","v":{"v":0.054,"d":"5.40%"}},{"$nulls":3},{"$f":"(SUM(F16:F25,F28:F46))*$B47/1.85","v":{"v":7.022969575538425,"d":"$7.02"}},{"$f":"(SUM(G16:G25,G28:G46))*$B47/2","v":{"v":5.491890108731739,"d":"$5.49"}},{"v":1.0043567486413043,"d":"$1.00"}]
[]
["Total Variable Costs",{"$nulls":4},{"$f":"SUM(F15:F47)","v":{"v":284.27470503379925,"d":"$284.27"}},{"$f":"SUM(G15:G47)","v":{"v":245.54522746916655,"d":"$245.55"}},{"$f":"SUM(H15:H47)","v":{"v":38.20275484646739,"d":"$38.20"}}]
["Returns Above Variable Costs",{"$nulls":4},{"$f":"F12-F49","v":{"v":21.52529496620076,"d":"$21.53"}},{"$f":"G12-G49","v":{"v":-40.65922746916655,"d":"($40.66)"}},{"$f":"H12-H49","v":{"v":62.71124515353261,"d":"$62.71"}}]
[]
["Fixed Costs"]
["Implements",{"v":1,"d":"1.00"},"acre",{"v":17.37,"d":"$17.37"},{"v":0,"d":"0%"},{"$f":"D53*B53","v":{"v":17.37,"d":"$17.37"}},{"$f":"F53*(1-E53)","v":{"v":17.37,"d":"$17.37"}},{"$f":"F53*E53","v":{"v":0,"d":"$0.00"}}]
["Tractors",{"v":1,"d":"1.00"},"acre",{"v":6.69,"d":"$6.69"},{"v":0,"d":"0%"},{"v":6.69,"d":"$6.69"},{"v":6.69,"d":"$6.69"},{"v":0,"d":"$0.00"}]
["Irrigation Equipment",{"v":1,"d":"1.00"},"acre",{"v":33.5,"d":"$33.50"},{"v":0,"d":"0%"},{"v":33.5,"d":"$33.50"},{"v":33.5,"d":"$33.50"},{"v":0,"d":"$0.00"}]
["Self Propelled Equipment",{"v":1,"d":"1.00"},"acre",{"v":0,"d":"$0.00"},{"v":1,"d":"100%"},{"v":0,"d":"$0.00"},{"v":0,"d":"$0.00"},{"v":0,"d":"$0.00"}]
["Pickup",{"v":1,"d":"1.00"},"acre",{"v":3.66,"d":"$3.66"},{"v":0,"d":"0%"},{"v":3.66,"d":"$3.66"},{"v":3.66,"d":"$3.66"},{"v":0,"d":"$0.00"}]
["Management",{"v":1,"d":"1.00"},"acre",{"v":0,"d":"$0.00"},{"v":0,"d":"0%"},{"v":0,"d":"$0.00"},{"v":0,"d":"$0.00"},{"v":0,"d":"$0.00"}]
["Irrigation Investment",{"v":1,"d":"1.00"},"acre",{"v":26.57,"d":"$26.57"},{"v":0,"d":"0%"},{"$f":"B59*D59","v":{"v":26.57,"d":"$26.57"}},{"v":26.57,"d":"$26.57"},{"v":0,"d":"$0.00"}]
["Land",{"v":1,"d":"1.00"},"acre",{"v":72,"d":"$72.00"},{"v":1,"d":"100%"},{"$f":"D60*B60","v":{"v":72,"d":"$72.00"}},{"$f":"IF($H$6=\"Cash\",D60,F60*(1-E60))","v":{"v":0,"d":"$0.00"}},{"$f":"IF($H$6=\"Cash\",0,F60*E60)","v":{"v":72,"d":"$72.00"}}]
["Property Tax",{"v":1,"d":"1.00"},"acre",{"v":0,"d":"$0.00"},{"v":1,"d":"100%"},{"$f":"B61*D61","v":{"v":0,"d":"$0.00"}},{"v":0,"d":"$0.00"},{"v":0,"d":"$0.00"}]
["Total Fixed Expenses",{"$nulls":4},{"$f":"SUM(F53:F61)","v":{"v":159.79,"d":"$159.79"}},{"$f":"SUM(G53:G61)","v":{"v":87.78999999999999,"d":"$87.79"}},{"$f":"SUM(H53:H61)","v":{"v":72,"d":"$72.00"}}]
["Total Specified Expenses",{"$nulls":4},{"$f":"F49+F62","v":{"v":444.0647050337992,"d":"$444.06"}},{"$f":"G49+G62","v":{"v":333.3352274691665,"d":"$333.34"}},{"$f":"H49+H62","v":{"v":110.2027548464674,"d":"$110.20"}}]
["Returns Above Total Specified Expenses",{"$nulls":4},{"$f":"F12-F63","v":{"v":-138.2647050337992,"d":"($138.26)"}},{"$f":"G12-G63","v":{"v":-128.44922746916652,"d":"($128.45)"}},{"$f":"H12-H63","v":{"v":-9.288754846467398,"d":"($9.29)"}}]
[]
["Return on Investment",{"$nulls":4},{"$f":"(F64/F63)","v":{"v":-0.3113616179499684,"d":"-31.14%"}},{"$f":"(G64/G63)","v":{"v":-0.38534549271738183,"d":"-38.53%"}},{"v":-0.08428786430437545,"d":"-8.43%"}]

{"sheet":"Irr Corn","index":5,"n_rows":64,"n_cols":9,"rows_kept":64,"merged":[[1,0,1,7],[2,0,2,7],[3,0,3,7]]}
[]
[" Estimated Costs and Returns per Acre"]
["Irrigated Corn"]
["Projected for 2016"]
[{"$nulls":7},"Rental Agreement","Share"]
["Item ","Quantity","Unit","Price","Landlord"," ",null,"Cash","Cash"]
[{"$nulls":4},"Share","Total","Tenant","Landlord"]
["Income"]
["corn grain",{"v":225,"d":"225.0"},"bu",{"$f":"'Universal Input Prices'!$B$6","v":{"v":3.8,"d":"$3.80"}},{"v":0.33,"d":"33%"},{"$f":"D9*B9","v":{"v":855,"d":"$855.00"}},{"$f":"F9*(1-E9)","v":{"v":572.8499999999999,"d":"$572.85"}},{"$f":"IF(H6=\"Cash\", D58,F9*E9)","v":{"v":120,"d":"$120.00"}}]
["other income",{"v":0,"d":"0.00"},"$/ac.",{"v":1,"d":"$1.00"},{"v":0.33,"d":"33%"},{"$f":"D10*B10","v":{"v":0,"d":"$0.00"}},{"$f":"F10*(1-E10)","v":{"v":0,"d":"$0.00"}},{"$f":"IF(H7=\"Cash\", D59,F10*E10)","v":{"v":0,"d":"$0.00"}}]
[]
["Total Income",{"$nulls":4},{"$f":"SUM(F8:F11)","v":{"v":855,"d":"$855.00"}},{"$f":"SUM(G8:G11)","v":{"v":572.8499999999999,"d":"$572.85"}},{"v":120,"d":"$120.00"}]
[]
["Variable Costs"]
["Seed"]
["corn seed",0.38,"bags",{"v":280,"d":"$280.000"},{"v":0,"d":"0%"},{"$f":"D16*B16","v":{"v":106.4,"d":"$106.40"}},{"$f":"F16*(1-E16)","v":{"v":106.4,"d":"$106.40"}},{"$f":"F16*E16","v":{"v":0,"d":"$0.00"}}]
["Fertilizer"]
["fert (N) - NH3 ",{"v":126,"d":"126.0"},"lb",{"$f":"IF(A18=\"\",0,VLOOKUP(A18,'Universal Input Prices'!$A$26:$B$30, 2))","v":{"v":0.25000000000000006,"d":"$0.250"}},{"v":0.33,"d":"33%"},{"$f":"D18*B18","v":{"v":31.500000000000007,"d":"$31.50"}},{"$f":"F18*(1-E18)","v":{"v":21.105000000000004,"d":"$21.11"}},{"$f":"F18*E18","v":{"v":10.395000000000003,"d":"$10.40"}}]
["fert (P) - liquid",{"v":60,"d":"60.0"},"lb",{"$f":"IF(A19=\"\",0,VLOOKUP(A19,'Universal Input Prices'!$A$26:$B$30, 2))","v":{"v":0.47,"d":"$0.470"}},{"v":0.33,"d":"33%"},{"$f":"D19*B19","v":{"v":28.2,"d":"$28.20"}},{"$f":"F19*(1-E19)","v":{"v":18.894,"d":"$18.89"}},{"$f":"F19*E19","v":{"v":9.306000000000001,"d":"$9.31"}}]
["fert (N) - liquid",{"v":78,"d":"78.0"},"lb",{"$f":"IF(A20=\"\",0,VLOOKUP(A20,'Universal Input Prices'!$A$26:$B$27, 2))","v":{"v":0.41015625,"d":"$0.410"}},{"v":0.33,"d":"33%"},{"$f":"D20*B20","v":{"v":31.9921875,"d":"$31.99"}},{"$f":"F20*(1-E20)","v":{"v":21.434765624999997,"d":"$21.43"}},{"$f":"F20*E20","v":{"v":10.557421875000001,"d":"$10.56"}}]
["Field Operations"]
["herbicide preplant",{"v":1,"d":"1.0"},"acre",{"v":17.4,"d":"$17.40"},{"v":0.33,"d":"33%"},{"$f":"D22*B22","v":{"v":17.4,"d":"$17.40"}},{"$f":"F22*(1-E22)","v":{"v":11.657999999999998,"d":"$11.66"}},{"$f":"F22*E22","v":{"v":5.742,"d":"$5.74"}}]
["fertilizer application",{"v":1,"d":"1.0"},"acre",{"v":15,"d":"$15.00"},{"v":0.33,"d":"33%"},{"v":15,"d":"$15.00"},{"v":10.049999999999999,"d":"$10.05"},{"v":4.95,"d":"$4.95"}]
["insecticide & application",{"v":1,"d":"1.0"},"acre",{"v":21,"d":"$21.00"},{"v":0.33,"d":"33%"},{"v":21,"d":"$21.00"},{"v":14.069999999999999,"d":"$14.07"},{"v":6.930000000000001,"d":"$6.93"}]
["custom harvest & haul",{"$f":"$B$9","v":{"v":225,"d":"225.0"}},"bu",{"v":0.4,"d":"$0.40"},{"v":0,"d":"0%"},{"v":90,"d":"$90.00"},{"v":90,"d":"$90.00"},{"v":0,"d":"$0.00"}]
["crop consultant",{"v":1,"d":"1.0"},"acre",{"v":8,"d":"$8.00"},{"v":0,"d":"0%"},{"v":8,"d":"$8.00"},{"v":8,"d":"$8.00"},{"v":0,"d":"$0.00"}]
["scouting",{"v":1,"d":"1.0"},"acre",{"v":0,"d":"$0.00"},{"v":0,"d":"0%"},{"$f":"D27*B27","v":{"v":0,"d":"$0.00"}},{"$f":"F27*(1-E27)","v":{"v":0,"d":"$0.00"}},{"$f":"F27*E27","v":{"v":0,"d":"$0.00"}}]
["herbicide postplant",{"v":1,"d":"1.0"},"acre",{"v":15.7,"d":"$15.70"},{"v":0,"d":"0%"},{"v":15.7,"d":"$15.70"},{"v":15.7,"d":"$15.70"},{"v":0,"d":"$0.00"}]
["other ",{"v":1,"d":"1.0"},"acre",{"v":0,"d":"$0.00"},{"v":0,"d":"0%"},{"v":0,"d":"$0.00"},{"v":0,"d":"$0.00"},{"v":0,"d":"$0.00"}]
["other ",{"v":1,"d":"1.0"},"acre",{"v":0,"d":"$0.00"},{"v":0,"d":"0%"},{"v":0,"d":"$0.00"},{"v":0,"d":"$0.00"},{"v":0,"d":"$0.00"}]
["Crop Insurance",{"v":1,"d":"1.0"},"acre",{"v":36.5,"d":"$36.50"},{"v":0.33,"d":"33%"},{"v":36.5,"d":"$36.50"},{"v":24.455,"d":"$24.46"},{"v":12.045,"d":"$12.05"}]
["Operator Labor & Hand Labor",{"v":0.975,"d":"0.98"},"hour",{"$f":"'Universal Input Prices'!$B$31","v":{"v":12.45,"d":"$12.45"}},{"v":0,"d":"0%"},{"v":12.138749999999998,"d":"$12.14"},{"v":12.138749999999998,"d":"$12.14"},{"v":0,"d":"$0.00"}]
["Irrigation Labor",1.41,"hours",{"$f":"'Universal Input Prices'!$B$31","v":{"v":12.45,"d":"$12.45"}},{"v":0,"d":"0%"},{"v":17.554499999999997,"d":"$17.55"},{"v":17.554499999999997,"d":"$17.55"},{"v":0,"d":"$0.00"}]
["Diesel Fuel - Tractors",2.66,"gallons",{"$f":"'Universal Input Prices'!$B$32","v":{"v":1.81,"d":"$1.81"}},{"v":0,"d":"0%"},{"v":4.8146,"d":"$4.81"},{"v":4.8146,"d":"$4.81"},{"v":0,"d":"$0.00"}]
["Gasoline - Pickup",{"v":3.0738462,"d":"3.07"},"gallons",{"$f":"'Universal Input Prices'!$B$33","v":{"v":1.926,"d":"$1.93"}},{"v":0,"d":"0%"},{"v":5.9202277812,"d":"$5.92"},{"v":5.9202277812,"d":"$5.92"},{"v":0,"d":"$0.00"}]
["Irrigation Fuel",{"v":22,"d":"22.00"},"acin",{"$f":"'Universal Input Prices'!$B$34","v":{"v":3.6,"d":"$3.60"}},{"v":0.33,"d":"33%"},{"v":79.2,"d":"$79.20"},{"v":53.06399999999999,"d":"$53.06"},{"v":26.136000000000003,"d":"$26.14"}]
["Pumping Days",69.14]
["Calculated GPM capacity per acre needed",{"$f":"B36*18.85694/B37","v":{"v":6.0001833960081,"d":"6.00"}}]
["Repair & Maintenance"]
["Implements",{"v":1,"d":"1.00"},"acre",{"v":10.78,"d":"$10.78"},{"v":0,"d":"0%"},{"$f":"D40*B40","v":{"v":10.78,"d":"$10.78"}},{"v":10.78,"d":"$10.78"},{"v":0,"d":"$0.00"}]
["Tractors",{"v":1,"d":"1.00"},"acre",{"v":4.89,"d":"$4.89"},{"v":0,"d":"0%"},{"$f":"D41*B41","v":{"v":4.89,"d":"$4.89"}},{"v":4.89,"d":"$4.89"},{"v":0,"d":"$0.00"}]
["Irrigation-Above Ground",{"$f":"Corn_Inches","v":{"v":22,"d":"22.00"}},"acin",{"v":4.04,"d":"$4.04"},{"v":0,"d":"0%"},{"$f":"D42*B42","v":{"v":88.88,"d":"$88.88"}},{"v":88.88,"d":"$88.88"},{"v":0,"d":"$0.00"}]
["Self Propelled Equipment",{"v":1,"d":"1.00"},"acre",{"v":0,"d":"$0.00"},{"v":1,"d":"100%"},{"$f":"D43*B43","v":{"v":0,"d":"$0.00"}},{"v":0,"d":"$0.00"},{"v":0,"d":"$0.00"}]
["Pickup",{"v":1,"d":"1.00"},"acre",{"v":3.76,"d":"$3.76"},{"v":0,"d":"0%"},{"$f":"D44*B44","v":{"v":3.76,"d":"$3.76"}},{"v":3.76,"d":"$3.76"},{"v":0,"d":"$0.00"}]
["Interest-operating capital",{"$f":"'Universal Input Prices'!$B$35","v":{"v":0.054,"d":"5.40%"}},{"$nulls":3},{"$f":"(SUM(F16:F24,F26:F44))*$B45/2.95","v":{"v":9.877977737350777,"d":"$9.88"}},{"$f":"(SUM(G16:G24,G26:G44))*$B45/2","v":{"v":12.246358771967401,"d":"$12.25"}},{"v":2.3236583906250003,"d":"$2.32"}]
[]
["Total Variable Costs",{"$nulls":4},{"$f":"SUM(F16:F45)","v":{"v":639.5082430185507,"d":"$639.51"}},{"$f":"SUM(G16:G45)","v":{"v":555.8152021781673,"d":"$555.82"}},{"$f":"SUM(H16:H45)","v":{"v":88.385080265625,"d":"$88.39"}}]
["Returns Above Variable Costs",{"$nulls":4},{"$f":"F12-F47","v":{"v":215.49175698144927,"d":"$215.49"}},{"$f":"G12-G47","v":{"v":17.034797821832626,"d":"$17.03"}},{"$f":"H12-H47","v":{"v":31.614919734374993,"d":"$31.61"}}]
[]
["Fixed Costs"]
["Implements",{"v":1,"d":"1.00"},"acre",{"v":16.92,"d":"$16.92"},{"v":0,"d":"0%"},{"$f":"D51*B51","v":{"v":16.92,"d":"$16.92"}},{"$f":"F51*(1-E51)","v":{"v":16.92,"d":"$16.92"}},{"$f":"F51*E51","v":{"v":0,"d":"$0.00"}}]
["Tractors",{"v":1,"d":"1.00"},"acre",{"v":6.95,"d":"$6.95"},{"v":0,"d":"0%"},{"v":6.95,"d":"$6.95"},{"v":6.95,"d":"$6.95"},{"v":0,"d":"$0.00"}]
["Irrigation Equipment",{"v":1,"d":"1.00"},"acre",{"v":47.34,"d":"$47.34"},{"v":0,"d":"0%"},{"v":47.34,"d":"$47.34"},{"v":47.34,"d":"$47.34"},{"v":0,"d":"$0.00"}]
["Self Propelled Equipment",{"v":1,"d":"1.00"},"acre",{"v":0,"d":"$0.00"},{"v":1,"d":"100%"},{"v":0,"d":"$0.00"},{"v":0,"d":"$0.00"},{"v":0,"d":"$0.00"}]
["Pickup",{"v":1,"d":"1.00"},"acre",{"v":5.49,"d":"$5.49"},{"v":0,"d":"0%"},{"v":5.49,"d":"$5.49"},{"v":5.49,"d":"$5.49"},{"v":0,"d":"$0.00"}]
["Management",{"v":1,"d":"1.00"},"acre",{"v":0,"d":"$0.00"},{"v":0,"d":"0%"},{"v":0,"d":"$0.00"},{"v":0,"d":"$0.00"},{"v":0,"d":"$0.00"}]
["Irrigation Investment",{"v":1,"d":"1.00"},"acre",{"v":32.3,"d":"$32.30"},{"v":0,"d":"0%"},{"v":32.3,"d":"$32.30"},{"v":32.3,"d":"$32.30"},{"v":0,"d":"$0.00"}]
["Land",{"v":1,"d":"1.00"},"acre",{"v":120,"d":"$120.00"},{"v":1,"d":"100%"},{"v":120,"d":"$120.00"},{"$f":"IF($H$6=\"Cash\",D58,F58*(1-E58))","v":{"v":120,"d":"$120.00"}},{"$f":"IF($H$6=\"Cash\",0,F58*E58)","v":{"v":0,"d":"$0.00"}}]
["Property Tax",{"v":1,"d":"1.00"},"acre",{"v":0,"d":"$0.00"},{"v":1,"d":"100%"},{"v":0,"d":"$0.00"},{"v":0,"d":"$0.00"},{"v":0,"d":"$0.00"}]
["Total Fixed Expenses",{"$nulls":4},{"$f":"SUM(F51:F59)","v":{"v":229,"d":"$229.00"}},{"$f":"SUM(G51:G59)","v":{"v":229,"d":"$229.00"}},{"$f":"SUM(H51:H59)","v":{"v":0,"d":"$0.00"}}]
["Total Specified Expenses",{"$nulls":4},{"$f":"F47+F60","v":{"v":868.5082430185507,"d":"$868.51"}},{"$f":"G47+G60","v":{"v":784.8152021781673,"d":"$784.82"}},{"$f":"H47+H60","v":{"v":88.385080265625,"d":"$88.39"}}]
["Returns Above Total Specified Expenses",{"$nulls":4},{"$f":"F12-F61","v":{"v":-13.50824301855073,"d":"($13.51)"}},{"$f":"G12-G61","v":{"v":-211.96520217816737,"d":"($211.97)"}},{"$f":"H12-H61","v":{"v":31.614919734374993,"d":"$31.61"}}]
[]
["Return on Investment",{"$nulls":4},{"$f":"(F62/F61)","v":{"v":-0.015553384930006015,"d":"-1.56%"}},{"$f":"(G62/G61)","v":{"v":-0.2700829463928343,"d":"-27.01%"}},{"v":0.35769520873163435,"d":"35.77%"}]

{"sheet":"Irr Corn Silage","index":6,"n_rows":64,"n_cols":9,"rows_kept":64,"merged":[[1,0,1,7],[2,0,2,7],[3,0,3,7]]}
[]
[" Estimated Costs and Returns per Acre"]
["Irrigated Corn Silage"]
["Projected for 2016"]
[{"$nulls":7},"Rental Agreement","Share"]
["Item ","Quantity","Unit","Price","Landlord"," ",null,"Share","Cash"]
[{"$nulls":4},"Share","Total","Tenant","Landlord"]
["Income"]
["corn silage",{"v":27,"d":"27.00"},"ton",{"$f":"'Universal Input Prices'!$B$7","v":{"v":35.1,"d":"$35.10"}},{"v":0.33,"d":"33%"},{"$f":"D9*B9","v":{"v":947.7,"d":"$947.70"}},{"$f":"F9*(1-E9)","v":{"v":634.959,"d":"$634.96"}},{"$f":"IF(H6=\"Cash\", D58,F9*E9)","v":{"v":312.74100000000004,"d":"$312.74"}}]
["other income",{"v":0,"d":"0.00"},"$/ac.",{"v":1,"d":"$1.00"},{"v":0.33,"d":"33%"},{"$f":"D10*B10","v":{"v":0,"d":"$0.00"}},{"$f":"F10*(1-E10)","v":{"v":0,"d":"$0.00"}},{"$f":"IF(H7=\"Cash\", D59,F10*E10)","v":{"v":0,"d":"$0.00"}}]
[]
["Total Income",{"$nulls":4},{"$f":"SUM(F8:F11)","v":{"v":947.7,"d":"$947.70"}},{"$f":"SUM(G8:G11)","v":{"v":634.959,"d":"$634.96"}},{"v":312.74100000000004,"d":"$312.74"}]
[]
["Variable Costs"]
["Seed"]
["corn seed",{"v":0.4,"d":"0.40"},"bags",{"v":280,"d":"$280.000"},{"v":0,"d":"0%"},{"$f":"D16*B16","v":{"v":112,"d":"$112.00"}},{"$f":"F16*(1-E16)","v":{"v":112,"d":"$112.00"}},{"$f":"F16*E16","v":{"v":0,"d":"$0.00"}}]
["Fertilizer"]
["fert (N) - NH3 ",{"v":126,"d":"126.0"},"lb",{"$f":"IF(A18=\"\",0,VLOOKUP(A18,'Universal Input Prices'!$A$26:$B$30, 2))","v":{"v":0.25000000000000006,"d":"$0.250"}},{"v":0.33,"d":"33%"},{"$f":"D18*B18","v":{"v":31.500000000000007,"d":"$31.50"}},{"$f":"F18*(1-E18)","v":{"v":21.105000000000004,"d":"$21.11"}},{"$f":"F18*E18","v":{"v":10.395000000000003,"d":"$10.40"}}]
["fert (P) - liquid",{"v":60,"d":"60.0"},"lb",{"$f":"IF(A19=\"\",0,VLOOKUP(A19,'Universal Input Prices'!$A$26:$B$30, 2))","v":{"v":0.47,"d":"$0.470"}},{"v":0.33,"d":"33%"},{"$f":"D19*B19","v":{"v":28.2,"d":"$28.20"}},{"$f":"F19*(1-E19)","v":{"v":18.894,"d":"$18.89"}},{"$f":"F19*E19","v":{"v":9.306000000000001,"d":"$9.31"}}]
["fert (N) - liquid",{"v":78,"d":"78.0"},"lb",{"$f":"IF(A20=\"\",0,VLOOKUP(A20,'Universal Input Prices'!$A$26:$B$27, 2))","v":{"v":0.41015625,"d":"$0.410"}},{"v":0.33,"d":"33%"},{"$f":"D20*B20","v":{"v":31.9921875,"d":"$31.99"}},{"$f":"F20*(1-E20)","v":{"v":21.434765624999997,"d":"$21.43"}},{"$f":"F20*E20","v":{"v":10.557421875000001,"d":"$10.56"}}]
["Field Operations"]
["herbicide preplant",{"v":1,"d":"1.0"},"acre",{"v":17.4,"d":"$17.40"},{"v":0.33,"d":"33%"},{"$f":"D22*B22","v":{"v":17.4,"d":"$17.40"}},{"$f":"F22*(1-E22)","v":{"v":11.657999999999998,"d":"$11.66"}},{"$f":"F22*E22","v":{"v":5.742,"d":"$5.74"}}]
["fertilizer application",{"v":1,"d":"1.0"},"acre",{"v":15,"d":"$15.00"},{"v":0.33,"d":"33%"},{"v":15,"d":"$15.00"},{"v":10.049999999999999,"d":"$10.05"},{"v":4.95,"d":"$4.95"}]
["insecticide & application",{"v":1,"d":"1.0"},"appl",{"v":25.7,"d":"$25.70"},{"v":0.33,"d":"33%"},{"v":25.7,"d":"$25.70"},{"v":17.218999999999998,"d":"$17.22"},{"v":8.481,"d":"$8.48"}]
["custom harvest & haul",{"$f":"$B$9","v":{"v":27,"d":"27.00"}},"ton",{"v":9.04,"d":"$9.04"},{"v":0,"d":"0%"},{"v":244.07999999999998,"d":"$244.08"},{"v":244.07999999999998,"d":"$244.08"},{"v":0,"d":"$0.00"}]
["crop consultant",{"v":1,"d":"1.0"},"acre",{"v":0,"d":"$0.00"},{"v":0,"d":"0%"},{"v":0,"d":"$0.00"},{"v":0,"d":"$0.00"},{"v":0,"d":"$0.00"}]
["scouting",{"v":1,"d":"1.0"},"acre",{"v":0,"d":"$0.00"},{"v":0,"d":"0%"},{"$f":"D27*B27","v":{"v":0,"d":"$0.00"}},{"$f":"F27*(1-E27)","v":{"v":0,"d":"$0.00"}},{"$f":"F27*E27","v":{"v":0,"d":"$0.00"}}]
["herbicide postplant",{"v":1,"d":"1.0"},"acre",{"v":15.7,"d":"$15.70"},{"v":0,"d":"0%"},{"v":15.7,"d":"$15.70"},{"v":15.7,"d":"$15.70"},{"v":0,"d":"$0.00"}]
["miticide",{"v":1,"d":"1.0"},"acre",{"v":21,"d":"$21.00"},{"v":0,"d":"0%"},{"v":21,"d":"$21.00"},{"v":21,"d":"$21.00"},{"v":0,"d":"$0.00"}]
["other ",{"v":1,"d":"1.0"},"acre",{"v":0,"d":"$0.00"},{"v":0,"d":"0%"},{"v":0,"d":"$0.00"},{"v":0,"d":"$0.00"},{"v":0,"d":"$0.00"}]
["Crop Insurance",{"v":1,"d":"1.0"},"acre",{"v":36.5,"d":"$36.50"},{"v":0.33,"d":"33%"},{"v":36.5,"d":"$36.50"},{"v":24.455,"d":"$24.46"},{"v":12.045,"d":"$12.05"}]
["Operator Labor & Hand Labor",{"v":1.1,"d":"1.10"},"hour",{"$f":"'Universal Input Prices'!$B$31","v":{"v":12.45,"d":"$12.45"}},{"v":0,"d":"0%"},{"v":13.695,"d":"$13.70"},{"v":13.695,"d":"$13.70"},{"v":0,"d":"$0.00"}]
["Irrigation Labor",1.28,"hours",{"$f":"'Universal Input Prices'!$B$31","v":{"v":12.45,"d":"$12.45"}},{"v":0,"d":"0%"},{"v":15.936,"d":"$15.94"},{"v":15.936,"d":"$15.94"},{"v":0,"d":"$0.00"}]
["Diesel Fuel - Tractors",3.01,"gallons",{"$f":"'Universal Input Prices'!$B$32","v":{"v":1.81,"d":"$1.81"}},{"v":0,"d":"0%"},{"v":5.4481,"d":"$5.45"},{"v":5.4481,"d":"$5.45"},{"v":0,"d":"$0.00"}]
["Gasoline - Pickup",{"v":3.073846154,"d":"3.07"},"gallons",{"$f":"'Universal Input Prices'!$B$33","v":{"v":1.926,"d":"$1.93"}},{"v":0,"d":"0%"},{"v":5.920227692604,"d":"$5.92"},{"v":5.920227692604,"d":"$5.92"},{"v":0,"d":"$0.00"}]
["Irrigation Fuel",{"v":20,"d":"20.00"},"acin",{"$f":"'Universal Input Prices'!$B$34","v":{"v":3.6,"d":"$3.60"}},{"v":0.33,"d":"33%"},{"v":72,"d":"$72.00"},{"v":48.239999999999995,"d":"$48.24"},{"v":23.76,"d":"$23.76"}]
["Pumping Days",62.86]
["Calculated GPM capacity per acre needed",{"$f":"B36*18.85694/B37","v":{"v":5.99966274260261,"d":"6.00"}}]
["Repair & Maintenance",{"$nulls":5},{"v":0,"d":"$0.00"},{"v":0,"d":"$0.00"}]
["Implements",{"v":1,"d":"1.00"},"acre",{"v":13.24,"d":"$13.24"},{"v":0,"d":"0%"},{"$f":"D40*B40","v":{"v":13.24,"d":"$13.24"}},{"v":13.24,"d":"$13.24"},{"v":0,"d":"$0.00"}]
["Tractors",{"v":1,"d":"1.00"},"acre",{"v":5.48,"d":"$5.48"},{"v":0,"d":"0%"},{"$f":"D41*B41","v":{"v":5.48,"d":"$5.48"}},{"v":5.48,"d":"$5.48"},{"v":0,"d":"$0.00"}]
["Irrigation-Above Ground",{"$f":"B36","v":{"v":20,"d":"20.00"}},"acin",{"v":4.04,"d":"$4.04"},{"v":0,"d":"0%"},{"$f":"D42*B42","v":{"v":80.8,"d":"$80.80"}},{"v":80.8,"d":"$80.80"},{"v":0,"d":"$0.00"}]
["Self Propelled Equipment",{"v":1,"d":"1.00"},"acre",{"v":0,"d":"$0.00"},{"v":1,"d":"100%"},{"$f":"D43*B43","v":{"v":0,"d":"$0.00"}},{"v":0,"d":"$0.00"},{"v":0,"d":"$0.00"}]
["Pickup",{"v":1,"d":"1.00"},"acre",{"v":3.76,"d":"$3.76"},{"v":0,"d":"0%"},{"$f":"D44*B44","v":{"v":3.76,"d":"$3.76"}},{"v":3.76,"d":"$3.76"},{"v":0,"d":"$0.00"}]
["Interest-operating capital",{"$f":"'Universal Input Prices'!$B$35","v":{"v":0.054,"d":"5.40%"}},{"$nulls":3},{"$f":"(SUM(F16:F24,F26:F44))*$B45/3","v":{"v":9.922887273466872,"d":"$9.92"}},{"$f":"(SUM(G16:G24,G26:G44))*$B45/2","v":{"v":12.582947519575308,"d":"$12.58"}},{"v":2.3013833906250003,"d":"$2.30"}]
[]
["Total Variable Costs",{"$nulls":4},{"$f":"SUM(F16:F45)","v":{"v":805.274402466071,"d":"$805.27"}},{"$f":"SUM(G16:G45)","v":{"v":722.6980408371794,"d":"$722.70"}},{"$f":"SUM(H16:H45)","v":{"v":87.53780526562501,"d":"$87.54"}}]
["Returns Above Variable Costs",{"$nulls":4},{"$f":"F12-F47","v":{"v":142.42559753392902,"d":"$142.43"}},{"$f":"G12-G47","v":{"v":-87.73904083717946,"d":"($87.74)"}},{"$f":"H12-H47","v":{"v":225.20319473437502,"d":"$225.20"}}]
[]
["Fixed Costs"]
["Implements",{"v":1,"d":"1.00"},"acre",{"v":20.35,"d":"$20.35"},{"v":0,"d":"0%"},{"$f":"D51*B51","v":{"v":20.35,"d":"$20.35"}},{"$f":"F51*(1-E51)","v":{"v":20.35,"d":"$20.35"}},{"$f":"F51*E51","v":{"v":0,"d":"$0.00"}}]
["Tractors",{"v":1,"d":"1.00"},"acre",{"v":7.83,"d":"$7.83"},{"v":0,"d":"0%"},{"v":7.83,"d":"$7.83"},{"v":7.83,"d":"$7.83"},{"v":0,"d":"$0.00"}]
["Irrigation Equipment",{"v":1,"d":"1.00"},"acre",{"v":47.34,"d":"$47.34"},{"v":0,"d":"0%"},{"v":47.34,"d":"$47.34"},{"v":47.34,"d":"$47.34"},{"v":0,"d":"$0.00"}]
["Self Propelled Equipment",{"v":1,"d":"1.00"},"acre",{"v":0,"d":"$0.00"},{"v":1,"d":"100%"},{"v":0,"d":"$0.00"},{"v":0,"d":"$0.00"},{"v":0,"d":"$0.00"}]
["Pickup",{"v":1,"d":"1.00"},"acre",{"v":5.49,"d":"$5.49"},{"v":0,"d":"0%"},{"v":5.49,"d":"$5.49"},{"v":5.49,"d":"$5.49"},{"v":0,"d":"$0.00"}]
["Management",{"v":1,"d":"1.00"},"acre",{"v":0,"d":"$0.00"},{"v":0,"d":"0%"},{"v":0,"d":"$0.00"},{"v":0,"d":"$0.00"},{"v":0,"d":"$0.00"}]
["Irrigation Investment",{"v":1,"d":"1.00"},"acre",{"v":32.3,"d":"$32.30"},{"v":0,"d":"0%"},{"v":32.3,"d":"$32.30"},{"v":32.3,"d":"$32.30"},{"v":0,"d":"$0.00"}]
["Land",{"v":1,"d":"1.00"},"acre",{"v":120,"d":"$120.00"},{"v":1,"d":"100%"},{"v":120,"d":"$120.00"},{"$f":"IF($H$6=\"Cash\",D58,F58*(1-E58))","v":{"v":0,"d":"$0.00"}},{"$f":"IF($H$6=\"Cash\",0,F58*E58)","v":{"v":120,"d":"$120.00"}}]
["Property Tax",{"v":1,"d":"1.00"},"acre",{"v":0,"d":"$0.00"},{"v":1,"d":"100%"},{"v":0,"d":"$0.00"},{"v":0,"d":"$0.00"},{"v":0,"d":"$0.00"}]
["Total Fixed Expenses",{"$nulls":4},{"$f":"SUM(F51:F59)","v":{"v":233.31,"d":"$233.31"}},{"$f":"SUM(G51:G59)","v":{"v":113.31,"d":"$113.31"}},{"$f":"SUM(H51:H59)","v":{"v":120,"d":"$120.00"}}]
["Total Specified Expenses",{"$nulls":4},{"$f":"F47+F60","v":{"v":1038.584402466071,"d":"$1,038.58"}},{"$f":"G47+G60","v":{"v":836.0080408371794,"d":"$836.01"}},{"$f":"H47+H60","v":{"v":207.53780526562502,"d":"$207.54"}}]
["Returns Above Total Specified Expenses",{"$nulls":4},{"$f":"F12-F61","v":{"v":-90.88440246607092,"d":"($90.88)"}},{"$f":"G12-G61","v":{"v":-201.0490408371794,"d":"($201.05)"}},{"$f":"H12-H61","v":{"v":105.20319473437502,"d":"$105.20"}}]
[]
["Return on Investment",{"$nulls":4},{"$f":"(F62/F61)","v":{"v":-0.0875079601140457,"d":"-8.75%"}},{"$f":"(G62/G61)","v":{"v":-0.24048697023996166,"d":"-24.05%"}},{"v":0.5069109919502462,"d":"50.69%"}]

{"sheet":"Irr Cotton","index":7,"n_rows":69,"n_cols":9,"rows_kept":69,"merged":[[1,0,1,7],[2,0,2,7],[3,0,3,7]]}
[]
[" Estimated Costs and Returns per Acre"]
["Irrigated Cotton"]
["Projected for 2016"]
[{"$nulls":7},"Rental Agreement","Share"]
["Item ","Quantity","Unit","Price","Landlord"," ",null,"Share","Cash"]
[{"$nulls":4},"Share","Total","Tenant","Landlord"]
["Income"]
["cotton lint",{"v":1250,"d":"1,250.0"},"lb",{"$f":"'Universal Input Prices'!$B$8","v":{"v":0.65,"d":"$0.6500"}},{"v":0.33,"d":"33%"},{"$f":"D9*B9","v":{"v":812.5,"d":"$812.50"}},{"$f":"F9*(1-E9)","v":{"v":544.3749999999999,"d":"$544.38"}},{"$f":"IF(H6=\"Cash\", D63,F9*E9)","v":{"v":268.125,"d":"$268.13"}}]
["cotton seed",{"$f":"B9/500*'Universal Input Prices'!B39/2000","v":{"v":0.9375,"d":"0.938"}},"tons",{"$f":"'Universal Input Prices'!$B$9","v":{"v":200,"d":"$200.00"}},{"v":0.33,"d":"33%"},{"$f":"D10*B10","v":{"v":187.5,"d":"$187.50"}},{"$f":"F10*(1-E10)","v":{"v":125.62499999999999,"d":"$125.63"}},{"$f":"IF(H6=\"Cash\", 0,F10*E10)","v":{"v":61.875,"d":"$61.88"}}]
["Expected Turnout",{"v":0.2725,"d":"27.3%"}]
["other income",{"v":0,"d":"0.00"},"$/ac.",{"v":1,"d":"$1.00"},{"v":0.33,"d":"33%"},{"$f":"D12*B12","v":{"v":0,"d":"$0.00"}},{"$f":"F12*(1-E12)","v":{"v":0,"d":"$0.00"}},{"$f":"IF(H9=\"Cash\", D61,F12*E12)","v":{"v":0,"d":"$0.00"}}]
["Total Income",{"$nulls":4},{"$f":"SUM(F8:F12)","v":{"v":1000,"d":"$1,000.00"}},{"$f":"SUM(G8:G12)","v":{"v":669.9999999999999,"d":"$670.00"}},{"v":330,"d":"$330.00"}]
[]
["Variable Costs"]
["Seed"]
["cotton seed",0.22,"bags",{"v":385,"d":"$385.000"},{"v":0,"d":"0%"},{"$f":"D17*B17","v":{"v":84.7,"d":"$84.70"}},{"$f":"F17*(1-E17)","v":{"v":84.7,"d":"$84.70"}},{"$f":"+F17*E17","v":{"v":0,"d":"$0.00"}}]
["Boll Weevil  Assess.-Irr",{"v":1,"d":"1.0"},"acre",{"v":0.7,"d":"$0.70"},{"v":0.33,"d":"33%"},{"$f":"D18*B18","v":{"v":0.7,"d":"$0.70"}},{"$f":"F18*(1-E18)","v":{"v":0.4689999999999999,"d":"$0.47"}},{"$f":"+F18*E18","v":{"v":0.23099999999999998,"d":"$0.23"}}]
["Fertilizer"]
["fert (P) - dry",{"v":40,"d":"40.0"},"lb",{"$f":"IF(A20=\"\",0,VLOOKUP(A20,'Universal Input Prices'!$A$26:$B$30, 2))","v":{"v":0.42980769230769234,"d":"$0.430"}},{"v":0.33,"d":"33%"},{"$f":"D20*B20","v":{"v":17.192307692307693,"d":"$17.19"}},{"$f":"F20*(1-E20)","v":{"v":11.518846153846154,"d":"$11.52"}},{"$f":"+F20*E20","v":{"v":5.673461538461539,"d":"$5.67"}}]
["fert (N) - dry",{"v":129.8,"d":"130"},"lb",{"$f":"IF(A21=\"\",0,VLOOKUP(A21,'Universal Input Prices'!$A$26:$B$30, 2))","v":{"v":0.33043478260869563,"d":"$0.330"}},{"v":0.33,"d":"33%"},{"$f":"D21*B21","v":{"v":42.89043478260869,"d":"$42.89"}},{"$f":"F21*(1-E21)","v":{"v":28.736591304347822,"d":"$28.74"}},{"$f":"+F21*E21","v":{"v":14.15384347826087,"d":"$14.15"}}]
[null,{"v":0,"d":"0.0"},"lb",{"$f":"IF(A22=\"\",0,VLOOKUP(A22,'Universal Input Prices'!$A$26:$B$30, 2))","v":{"v":0,"d":"$0.000"}},{"v":0,"d":"0%"},{"$f":"D22*B22","v":{"v":0,"d":"$0.00"}},{"$f":"F22*(1-E22)","v":{"v":0,"d":"$0.00"}},{"$f":"F22*E22","v":{"v":0,"d":"$0.00"}}]
["Field Operations"]
["preplant herbicide & application",{"v":1,"d":"1.0"},"acre",{"v":14.5,"d":"$14.50"},{"v":0.33,"d":"33%"},{"$f":"D24*B24","v":{"v":14.5,"d":"$14.50"}},{"$f":"F24*(1-E24)","v":{"v":9.715,"d":"$9.72"}},{"$f":"+F24*E24","v":{"v":4.785,"d":"$4.79"}}]
["post emergence herbicide & application",{"v":1,"d":"1.0"},"acre",{"v":19.4,"d":"$19.40"},{"v":0.33,"d":"33%"},{"$f":"D25*B25","v":{"v":19.4,"d":"$19.40"}},{"v":12.997999999999998,"d":"$13.00"},{"v":6.402,"d":"$6.40"}]
["fertilizer application",{"v":1,"d":"1.0"},"acre",{"v":5,"d":"$5.00"},{"v":0.33,"d":"33%"},{"v":5,"d":"$5.00"},{"v":3.3499999999999996,"d":"$3.35"},{"v":1.6500000000000001,"d":"$1.65"}]
["insecticide & application",{"v":1,"d":"1.0"},"acre",{"v":9.6,"d":"$9.60"},{"v":0.33,"d":"33%"},{"v":9.6,"d":"$9.60"},{"v":6.4319999999999995,"d":"$6.43"},{"v":3.168,"d":"$3.17"}]
["harvest aids",{"v":0.75,"d":"0.8"},"acre",{"v":25,"d":"$25.00"},{"v":0.33,"d":"33%"},{"v":18.75,"d":"$18.75"},{"v":12.562499999999998,"d":"$12.56"},{"v":6.1875,"d":"$6.19"}]
["strip & module",{"$f":"B9/100","v":12.5},"cwt.",{"$f":"'Universal Input Prices'!$B$37","v":{"v":8,"d":"$8.00"}},{"v":0,"d":"0%"},{"v":100,"d":"$100.00"},{"v":100,"d":"$100.00"},{"v":0,"d":"$0.00"}]
["ginning",{"$f":"B9/B11/100","v":{"v":45.871559633027516,"d":"45.87"}},"cwt.",{"$f":"'Universal Input Prices'!$B$38","v":{"v":2.75,"d":"$2.75"}},{"v":0.33,"d":"33%"},{"v":126.14678899082567,"d":"$126.15"},{"v":84.51834862385319,"d":"$84.52"},{"v":41.62844036697247,"d":"$41.63"}]
["hoeing",{"v":1,"d":"1.0"},"acre",{"v":0,"d":"$0.00"},{"v":0,"d":"0%"},{"v":0,"d":"$0.00"},{"v":0,"d":"$0.00"},{"v":0,"d":"$0.00"}]
["scouting",{"v":1,"d":"1.0"},"acre",{"v":0,"d":"$0.00"},{"v":0,"d":"0%"},{"$f":"D32*B32","v":{"v":0,"d":"$0.00"}},{"$f":"F32*(1-E32)","v":{"v":0,"d":"$0.00"}},{"$f":"+F32*E32","v":{"v":0,"d":"$0.00"}}]
["other ",{"v":1,"d":"1.0"},"acre",{"v":0,"d":"$0.00"},{"v":0,"d":"0%"},{"v":0,"d":"$0.00"},{"v":0,"d":"$0.00"},{"v":0,"d":"$0.00"}]
["other ",{"v":1,"d":"1.0"},"acre",{"v":0,"d":"$0.00"},{"v":0,"d":"0%"},{"v":0,"d":"$0.00"},{"v":0,"d":"$0.00"},{"v":0,"d":"$0.00"}]
["other ",{"v":1,"d":"1.0"},"acre",{"v":0,"d":"$0.00"},{"v":0,"d":"0%"},{"v":0,"d":"$0.00"},{"v":0,"d":"$0.00"},{"v":0,"d":"$0.00"}]
["Crop Insurance",{"v":1,"d":"1.0"},"acre",{"v":55,"d":"$55.00"},{"v":0.33,"d":"33%"},{"v":55,"d":"$55.00"},{"v":36.849999999999994,"d":"$36.85"},{"v":18.150000000000002,"d":"$18.15"}]
["Operator Labor & Hand Labor",1.15,"hours",{"$f":"'Universal Input Prices'!$B$31","v":{"v":12.45,"d":"$12.45"}},{"v":0,"d":"0%"},{"v":14.317499999999997,"d":"$14.32"},{"v":14.317499999999997,"d":"$14.32"},{"v":0,"d":"$0.00"}]
["Irrigation Labor",{"v":0.768,"d":"0.77"},"hours",{"$f":"'Universal Input Prices'!$B$31","v":{"v":12.45,"d":"$12.45"}},{"v":0,"d":"0%"},{"v":9.5616,"d":"$9.56"},{"v":9.5616,"d":"$9.56"},{"v":0,"d":"$0.00"}]
["Diesel Fuel - Tractors",2.88,"gallons",{"$f":"'Universal Input Prices'!$B$32","v":{"v":1.81,"d":"$1.81"}},{"v":0,"d":"0%"},{"v":5.2128,"d":"$5.21"},{"v":5.2128,"d":"$5.21"},{"v":0,"d":"$0.00"}]
["Gasoline - Pickup",{"v":3.4830769,"d":"3.48"},"gallons",{"$f":"'Universal Input Prices'!$B$33","v":{"v":1.926,"d":"$1.93"}},{"v":0,"d":"0%"},{"v":6.708406109399999,"d":"$6.71"},{"v":6.708406109399999,"d":"$6.71"},{"v":0,"d":"$0.00"}]
["Irrigation Fuel",{"v":12,"d":"12.00"},"acin",{"$f":"'Universal Input Prices'!$B$34","v":{"v":3.6,"d":"$3.60"}},{"v":0.33,"d":"33%"},{"v":43.2,"d":"$43.20"},{"v":28.944,"d":"$28.94"},{"v":14.256000000000002,"d":"$14.26"}]
["Pumping Days",75.43]
["Calculated GPM capacity per acre needed",{"$f":"B41*18.85694/B42","v":{"v":2.999910910778205,"d":"3.00"}}]
["Repair & Maintenance"]
["Implements",{"v":1,"d":"1.00"},"acre",{"v":4.75,"d":"$4.75"},{"v":0,"d":"0%"},{"$f":"D45*B45","v":{"v":4.75,"d":"$4.75"}},{"$f":"F45*(1-E45)","v":{"v":4.75,"d":"$4.75"}},{"$f":"+F45*E45","v":{"v":0,"d":"$0.00"}}]
["Tractors",{"v":1,"d":"1.00"},"acre",{"v":5.27,"d":"$5.27"},{"v":0,"d":"0%"},{"$f":"D46*B46","v":{"v":5.27,"d":"$5.27"}},{"$f":"F46*(1-E46)","v":{"v":5.27,"d":"$5.27"}},{"$f":"+F46*E46","v":{"v":0,"d":"$0.00"}}]
["Irrigation-Above Ground",{"$f":"Cotton_Inches","v":{"v":12,"d":"12.00"}},"acin",{"v":4.04,"d":"$4.04"},{"v":0,"d":"0%"},{"$f":"D47*B47","v":{"v":48.480000000000004,"d":"$48.48"}},{"$f":"F47*(1-E47)","v":{"v":48.480000000000004,"d":"$48.48"}},{"$f":"+F47*E47","v":{"v":0,"d":"$0.00"}}]
["Self Propelled Equipment",{"v":1,"d":"1.00"},"acre",{"v":0,"d":"$0.00"},{"v":1,"d":"100%"},{"$f":"D48*B48","v":{"v":0,"d":"$0.00"}},{"$f":"F48*(1-E48)","v":{"v":0,"d":"$0.00"}},{"$f":"+F48*E48","v":{"v":0,"d":"$0.00"}}]
["Pickup",{"v":1,"d":"1.00"},"acre",{"v":4.26,"d":"$4.26"},{"v":0,"d":"0%"},{"$f":"D49*B49","v":{"v":4.26,"d":"$4.26"}},{"$f":"F49*(1-E49)","v":{"v":4.26,"d":"$4.26"}},{"$f":"+F49*E49","v":{"v":0,"d":"$0.00"}}]
["Interest-operating capital",{"$f":"'Universal Input Prices'!$B$35","v":{"v":0.054,"d":"5.40%"}},{"$nulls":3},{"$f":"(SUM(F17:F27,F31:F49))*$B50/1.85","v":{"v":11.405472769488155,"d":"$11.41"}},{"$f":"(SUM(G17:G27,G31:G49))*$B50/2","v":{"v":8.701391076325034,"d":"$8.70"}},{"v":1.8486712354515051,"d":"$1.85"}]
[]
["Total Variable Costs",{"$nulls":4},{"$f":"SUM(F17:F50)","v":{"v":647.0453103446303,"d":"$647.05"}},{"$f":"SUM(G17:G50)","v":{"v":528.0559832677721,"d":"$528.06"}},{"$f":"SUM(H17:H50)","v":{"v":118.13391661914639,"d":"$118.13"}}]
["Returns Above Variable Costs",{"$nulls":4},{"$f":"F13-F52","v":{"v":352.95468965536975,"d":"$352.95"}},{"$f":"G13-G52","v":{"v":141.94401673222774,"d":"$141.94"}},{"$f":"H13-H52","v":{"v":211.8660833808536,"d":"$211.87"}}]
[]
["Fixed Costs"]
["Implements",{"v":1,"d":"1.00"},"acre",{"v":6.87,"d":"$6.87"},{"v":0,"d":"0%"},{"$f":"D56*B56","v":{"v":6.87,"d":"$6.87"}},{"$f":"F56*(1-E56)","v":{"v":6.87,"d":"$6.87"}},{"$f":"+F56*E56","v":{"v":0,"d":"$0.00"}}]
["Tractors",{"v":1,"d":"1.00"},"acre",{"v":7.12,"d":"$7.12"},{"v":0,"d":"0%"},{"v":7.12,"d":"$7.12"},{"v":7.12,"d":"$7.12"},{"v":0,"d":"$0.00"}]
["Irrigation Equipment",{"v":1,"d":"1.00"},"acre",{"v":33.5,"d":"$33.50"},{"v":0,"d":"0%"},{"v":33.5,"d":"$33.50"},{"v":33.5,"d":"$33.50"},{"v":0,"d":"$0.00"}]
["Self Propelled Equipment",{"v":1,"d":"1.00"},"acre",{"v":0,"d":"$0.00"},{"v":1,"d":"100%"},{"v":0,"d":"$0.00"},{"v":0,"d":"$0.00"},{"v":0,"d":"$0.00"}]
["Pickup",{"v":1,"d":"1.00"},"acre",{"v":6.23,"d":"$6.23"},{"v":0,"d":"0%"},{"v":6.23,"d":"$6.23"},{"v":6.23,"d":"$6.23"},{"v":0,"d":"$0.00"}]
["Management",{"v":1,"d":"1.00"},"acre",{"v":0,"d":"$0.00"},{"v":0,"d":"0%"},{"$f":"D61*B61","v":{"v":0,"d":"$0.00"}},{"v":0,"d":"$0.00"},{"v":0,"d":"$0.00"}]
["Irrigation Investment",{"v":1,"d":"1.00"},"acre",{"v":26.57,"d":"$26.57"},{"v":0,"d":"0%"},{"$f":"D62*B62","v":{"v":26.57,"d":"$26.57"}},{"v":26.57,"d":"$26.57"},{"v":0,"d":"$0.00"}]
["Land",{"v":1,"d":"1.00"},"acre",{"v":72,"d":"$72.00"},{"v":1,"d":"100%"},{"v":72,"d":"$72.00"},{"$f":"IF($H$6=\"Cash\",D63,F63*(1-E63))","v":{"v":0,"d":"$0.00"}},{"$f":"IF($H$6=\"Cash\",0,F63*E63)","v":{"v":72,"d":"$72.00"}}]
["Property Tax",{"v":1,"d":"1.00"},"acre",{"v":0,"d":"$0.00"},{"v":1,"d":"100%"},{"$f":"B64*D64","v":{"v":0,"d":"$0.00"}},{"v":0,"d":"$0.00"},{"v":0,"d":"$0.00"}]
["Total Fixed Expenses",{"$nulls":4},{"$f":"SUM(F56:F64)","v":{"v":152.29,"d":"$152.29"}},{"$f":"SUM(G56:G64)","v":{"v":80.28999999999999,"d":"$80.29"}},{"$f":"SUM(H56:H64)","v":{"v":72,"d":"$72.00"}}]
["Total Specified Expenses",{"$nulls":4},{"$f":"F52+F65","v":{"v":799.3353103446302,"d":"$799.34"}},{"$f":"G52+G65","v":{"v":608.3459832677721,"d":"$608.35"}},{"$f":"H52+H65","v":{"v":190.1339166191464,"d":"$190.13"}}]
["Returns Above Total Specified Expenses",{"$nulls":4},{"$f":"F13-F66","v":{"v":200.66468965536978,"d":"$200.66"}},{"$f":"G13-G66","v":{"v":61.654016732227774,"d":"$61.65"}},{"$f":"H13-H66","v":{"v":139.8660833808536,"d":"$139.87"}}]
[]
["Return on Investment",{"$nulls":4},{"$f":"(F67/F66)","v":{"v":0.2510394412187972,"d":"25.10%"}},{"$f":"(G67/G66)","v":{"v":0.10134696115037861,"d":"10.13%"}},{"v":0.7356187989385223,"d":"73.56%"}]

{"sheet":"Irr Peanuts","index":8,"n_rows":68,"n_cols":9,"rows_kept":68,"merged":[[1,0,1,7],[2,0,2,7],[3,0,3,7]]}
[]
[" Estimated Costs and Returns per Acre"]
["Irrigated Peanuts"]
["Projected for 2016"]
[{"$nulls":7},"Rental Agreement","Share"]
["Item ","Quantity","Unit","Price","Landlord"," ",null,"Share","Cash"]
[{"$nulls":4},"Share","Total","Tenant","Landlord"]
["Income"]
["peanuts",2.25,"ton",{"$f":"'Universal Input Prices'!$B$10","v":{"v":420,"d":"$420.00"}},{"v":0.33,"d":"33%"},{"$f":"D9*B9","v":{"v":945,"d":"$945.00"}},{"$f":"F9*(1-E9)","v":{"v":633.15,"d":"$633.15"}},{"$f":"IF(H6=\"Cash\", D62,F9*E9)","v":{"v":311.85,"d":"$311.85"}}]
["other income",{"v":0,"d":"0.00"},"$/ac.",{"v":1,"d":"$1.00"},{"v":0.33,"d":"33%"},{"$f":"D10*B10","v":{"v":0,"d":"$0.00"}},{"$f":"F10*(1-E10)","v":{"v":0,"d":"$0.00"}},{"$f":"IF(H7=\"Cash\", D59,F10*E10)","v":{"v":0,"d":"$0.00"}}]
[]
["Total Income",{"$nulls":4},{"$f":"SUM(F8:F11)","v":{"v":945,"d":"$945.00"}},{"$f":"SUM(G8:G11)","v":{"v":633.15,"d":"$633.15"}},{"v":311.85,"d":"$311.85"}]
[]
["Variable Costs"]
["Seed"]
["peanut seed",{"v":100,"d":"100.00"},"lb",{"v":1,"d":"$1.00"},{"v":0,"d":"0%"},{"$f":"D16*B16","v":{"v":100,"d":"$100.00"}},{"$f":"F16*(1-E16)","v":{"v":100,"d":"$100.00"}},{"$f":"F16*E16","v":{"v":0,"d":"$0.00"}}]
["innoculant",{"v":1,"d":"1.0"},"acre",{"v":7.3,"d":"$7.30"},{"v":0,"d":"0%"},{"$f":"D17*B17","v":{"v":7.3,"d":"$7.30"}},{"$f":"F17*(1-E17)","v":{"v":7.3,"d":"$7.30"}},{"$f":"F17*E17","v":{"v":0,"d":"$0.00"}}]
["Fertilizer"]
["fert (P) - dry",{"v":50,"d":"50.0"},"lb",{"$f":"IF(A19=\"\",0,VLOOKUP(A19,'Universal Input Prices'!$A$26:$B$30, 2))","v":{"v":0.42980769230769234,"d":"$0.430"}},{"v":0.33,"d":"33%"},{"$f":"D19*B19","v":{"v":21.490384615384617,"d":"$21.49"}},{"$f":"F19*(1-E19)","v":{"v":14.398557692307692,"d":"$14.40"}},{"$f":"F19*E19","v":{"v":7.0918269230769235,"d":"$7.09"}}]
["fert (N) - dry",{"v":79.9,"d":"80"},"lb",{"$f":"IF(A20=\"\",0,VLOOKUP(A20,'Universal Input Prices'!$A$26:$B$27, 2))","v":{"v":0.33043478260869563,"d":"$0.330"}},{"v":0.33,"d":"33%"},{"$f":"D20*B20","v":{"v":26.401739130434784,"d":"$26.40"}},{"$f":"F20*(1-E20)","v":{"v":17.689165217391302,"d":"$17.69"}},{"$f":"F20*E20","v":{"v":8.71257391304348,"d":"$8.71"}}]
[null,{"v":0,"d":"0.0"},"lb",{"$f":"IF(A21=\"\",0,VLOOKUP(A21,'Universal Input Prices'!$A$26:$B$30, 2))","v":{"v":0,"d":"$0.000"}},{"v":0,"d":"0%"},{"$f":"D21*B21","v":{"v":0,"d":"$0.00"}},{"$f":"F21*(1-E21)","v":{"v":0,"d":"$0.00"}},{"$f":"F21*E21","v":{"v":0,"d":"$0.00"}}]
["Field Operations"]
["herbicide & application",{"v":1,"d":"1.0"},"acre",{"v":17.45,"d":"$17.45"},{"v":0.33,"d":"33%"},{"$f":"D23*B23","v":{"v":17.45,"d":"$17.45"}},{"$f":"F23*(1-E23)","v":{"v":11.691499999999998,"d":"$11.69"}},{"$f":"F23*E23","v":{"v":5.7585,"d":"$5.76"}}]
["fertilizer application",{"v":1,"d":"1.0"},"acre",{"v":5,"d":"$5.00"},{"v":0.33,"d":"33%"},{"v":5,"d":"$5.00"},{"v":3.3499999999999996,"d":"$3.35"},{"v":1.6500000000000001,"d":"$1.65"}]
["fungicide & application",{"v":3,"d":"3.0"},"appl",{"v":15.85,"d":"$15.85"},{"v":0.33,"d":"33%"},{"v":47.55,"d":"$47.55"},{"v":31.858499999999996,"d":"$31.86"},{"v":15.6915,"d":"$15.69"}]
["digging",{"v":1,"d":"1.0"},"acre",{"v":25,"d":"$25.00"},{"v":0.33,"d":"33%"},{"v":25,"d":"$25.00"},{"v":16.75,"d":"$16.75"},{"v":8.25,"d":"$8.25"}]
["custom harvest & haul",{"$f":"$B$9","v":2.25},"ton",{"v":40,"d":"$40.00"},{"v":0,"d":"0%"},{"v":90,"d":"$90.00"},{"v":90,"d":"$90.00"},{"v":0,"d":"$0.00"}]
["drying",{"$f":"$B$9","v":2.25},"ton",{"v":25,"d":"$25.00"},{"v":0,"d":"0%"},{"v":56.25,"d":"$56.25"},{"v":56.25,"d":"$56.25"},{"v":0,"d":"$0.00"}]
["insecticide & application",{"v":1,"d":"1.0"},"appl",{"v":9.6,"d":"$9.60"},{"v":0.33,"d":"33%"},{"v":9.6,"d":"$9.60"},{"v":6.4319999999999995,"d":"$6.43"},{"v":3.168,"d":"$3.17"}]
["hoeing",{"v":1,"d":"1.0"},"acre",{"v":19,"d":"$19.00"},{"v":0,"d":"0%"},{"v":19,"d":"$19.00"},{"v":19,"d":"$19.00"},{"v":0,"d":"$0.00"}]
["scouting",{"v":1,"d":"1.0"},"acre",{"v":0,"d":"$0.00"},{"v":0,"d":"0%"},{"v":0,"d":"$0.00"},{"v":0,"d":"$0.00"},{"v":0,"d":"$0.00"}]
["other ",{"v":1,"d":"1.0"},"acre",{"v":0,"d":"$0.00"},{"v":0,"d":"0%"},{"v":0,"d":"$0.00"},{"v":0,"d":"$0.00"},{"$f":"+F32*E32","v":{"v":0,"d":"$0.00"}}]
["other ",{"v":1,"d":"1.0"},"acre",{"v":0,"d":"$0.00"},{"v":0,"d":"0%"},{"v":0,"d":"$0.00"},{"v":0,"d":"$0.00"},{"$f":"+F33*E33","v":{"v":0,"d":"$0.00"}}]
["other ",{"v":1,"d":"1.0"},"acre",{"v":0,"d":"$0.00"},{"v":0,"d":"0%"},{"v":0,"d":"$0.00"},{"v":0,"d":"$0.00"},{"$f":"+F34*E34","v":{"v":0,"d":"$0.00"}}]
["Crop Insurance",{"v":1,"d":"1.0"},"acre",{"v":40,"d":"$40.00"},{"v":0.33,"d":"33%"},{"v":40,"d":"$40.00"},{"v":26.799999999999997,"d":"$26.80"},{"v":13.200000000000001,"d":"$13.20"}]
["Operator Labor & Hand Labor",{"v":2.595,"d":"2.60"},"hour",{"$f":"'Universal Input Prices'!$B$31","v":{"v":12.45,"d":"$12.45"}},{"v":0,"d":"0%"},{"v":32.30775,"d":"$32.31"},{"v":32.30775,"d":"$32.31"},{"v":0,"d":"$0.00"}]
["Irrigation Labor",{"v":1.344,"d":"1.34"},"hours",{"$f":"'Universal Input Prices'!$B$31","v":{"v":12.45,"d":"$12.45"}},{"v":0,"d":"0%"},{"v":16.7328,"d":"$16.73"},{"v":16.7328,"d":"$16.73"},{"v":0,"d":"$0.00"}]
["Diesel Fuel - Tractors",6.82,"gallons",{"$f":"'Universal Input Prices'!$B$32","v":{"v":1.81,"d":"$1.81"}},{"v":0,"d":"0%"},{"v":12.3442,"d":"$12.34"},{"v":12.3442,"d":"$12.34"},{"v":0,"d":"$0.00"}]
["Gasoline - Pickup",{"v":2.049230769,"d":"2.05"},"gallons",{"$f":"'Universal Input Prices'!$B$33","v":{"v":1.926,"d":"$1.93"}},{"v":0,"d":"0%"},{"v":3.9468184610939994,"d":"$3.95"},{"v":3.9468184610939994,"d":"$3.95"},{"v":0,"d":"$0.00"}]
["Irrigation Fuel",{"v":21,"d":"21.00"},"acin",{"$f":"'Universal Input Prices'!$B$34","v":{"v":3.6,"d":"$3.60"}},{"v":0.33,"d":"33%"},{"v":75.60000000000001,"d":"$75.60"},{"v":50.652,"d":"$50.65"},{"v":24.948000000000004,"d":"$24.95"}]
["Pumping Days",{"v":79.2,"d":"79.20"}]
["Calculated GPM capacity per acre needed",{"$f":"B40*18.85694/B41","v":{"v":4.999946212121212,"d":"5.00"}}]
["Repair & Maintenance",{"$nulls":5},{"v":0,"d":"$0.00"},{"v":0,"d":"$0.00"}]
["Implements",{"v":1,"d":"1.00"},"acre",{"v":24.39,"d":"$24.39"},{"v":0,"d":"0%"},{"$f":"D44*B44","v":{"v":24.39,"d":"$24.39"}},{"v":24.39,"d":"$24.39"},{"v":0,"d":"$0.00"}]
["Tractors",{"v":1,"d":"1.00"},"acre",{"v":11.8,"d":"$11.80"},{"v":0,"d":"0%"},{"$f":"D45*B45","v":{"v":11.8,"d":"$11.80"}},{"v":11.8,"d":"$11.80"},{"v":0,"d":"$0.00"}]
["Irrigation-Above Ground",{"$f":"B40","v":{"v":21,"d":"21.00"}},"acin",{"v":4.04,"d":"$4.04"},{"v":0,"d":"0%"},{"$f":"D46*B46","v":{"v":84.84,"d":"$84.84"}},{"v":84.84,"d":"$84.84"},{"v":0,"d":"$0.00"}]
["Self Propelled Equipment",{"v":1,"d":"1.00"},"acre",{"v":0,"d":"$0.00"},{"v":1,"d":"100%"},{"$f":"D47*B47","v":{"v":0,"d":"$0.00"}},{"v":0,"d":"$0.00"},{"v":0,"d":"$0.00"}]
["Pickup",{"v":1,"d":"1.00"},"acre",{"v":2.51,"d":"$2.51"},{"v":0,"d":"0%"},{"$f":"D48*B48","v":{"v":2.51,"d":"$2.51"}},{"v":2.51,"d":"$2.51"},{"v":0,"d":"$0.00"}]
["Interest-operating capital",{"$f":"'Universal Input Prices'!$B$35","v":{"v":0.054,"d":"5.40%"}},{"$nulls":3},{"$f":"(SUM(F16:F25,F29:F48))*$B49/2.5","v":{"v":12.058495751669328,"d":"$12.06"}},{"$f":"(SUM(G16:G25,G29:G48))*$B49/2","v":{"v":12.907168867011407,"d":"$12.91"}},{"v":2.165950822575251,"d":"$2.17"}]
[]
["Total Variable Costs",{"$nulls":4},{"$f":"SUM(F16:F49)","v":{"v":741.5721879585827,"d":"$741.57"}},{"$f":"SUM(G16:G49)","v":{"v":653.9504602378044,"d":"$653.95"}},{"$f":"SUM(H16:H49)","v":{"v":90.63635165869566,"d":"$90.64"}}]
["Returns Above Variable Costs",{"$nulls":4},{"$f":"F12-F51","v":{"v":203.42781204141727,"d":"$203.43"}},{"$f":"G12-G51","v":{"v":-20.800460237804373,"d":"($20.80)"}},{"$f":"H12-H51","v":{"v":221.21364834130435,"d":"$221.21"}}]
[]
["Fixed Costs"]
["Implements",{"v":1,"d":"1.00"},"acre",{"v":35.81,"d":"$35.81"},{"v":0,"d":"0%"},{"$f":"D55*B55","v":{"v":35.81,"d":"$35.81"}},{"$f":"F55*(1-E55)","v":{"v":35.81,"d":"$35.81"}},{"$f":"F55*E55","v":{"v":0,"d":"$0.00"}}]
["Tractors",{"v":1,"d":"1.00"},"acre",{"v":17.05,"d":"$17.05"},{"v":0,"d":"0%"},{"v":17.05,"d":"$17.05"},{"v":17.05,"d":"$17.05"},{"v":0,"d":"$0.00"}]
["Irrigation Equipment",{"v":1,"d":"1.00"},"acre",{"v":47.34,"d":"$47.34"},{"v":0,"d":"0%"},{"v":47.34,"d":"$47.34"},{"v":47.34,"d":"$47.34"},{"v":0,"d":"$0.00"}]
["Self Propelled Equipment",{"v":1,"d":"1.00"},"acre",{"v":0,"d":"$0.00"},{"v":1,"d":"100%"},{"v":0,"d":"$0.00"},{"v":0,"d":"$0.00"},{"v":0,"d":"$0.00"}]
["Pickup",{"v":1,"d":"1.00"},"acre",{"v":3.66,"d":"$3.66"},{"v":0,"d":"0%"},{"v":3.66,"d":"$3.66"},{"v":3.66,"d":"$3.66"},{"v":0,"d":"$0.00"}]
["Management",{"v":1,"d":"1.00"},"acre",{"v":0,"d":"$0.00"},{"v":0,"d":"0%"},{"v":0,"d":"$0.00"},{"v":0,"d":"$0.00"},{"v":0,"d":"$0.00"}]
["Irrigation Investment",{"v":1,"d":"1.00"},"acre",{"v":32.3,"d":"$32.30"},{"v":0,"d":"0%"},{"$f":"B61*D61","v":{"v":32.3,"d":"$32.30"}},{"v":32.3,"d":"$32.30"},{"v":0,"d":"$0.00"}]
["Land",{"v":1,"d":"1.00"},"acre",{"v":72,"d":"$72.00"},{"v":1,"d":"100%"},{"$f":"D62*B62","v":{"v":72,"d":"$72.00"}},{"$f":"IF($H$6=\"Cash\",D62,F62*(1-E62))","v":{"v":0,"d":"$0.00"}},{"$f":"IF($H$6=\"Cash\",0,F62*E62)","v":{"v":72,"d":"$72.00"}}]
["Property Tax",{"v":1,"d":"1.00"},"acre",{"v":0,"d":"$0.00"},{"v":1,"d":"100%"},{"$f":"B63*D63","v":{"v":0,"d":"$0.00"}},{"v":0,"d":"$0.00"},{"v":0,"d":"$0.00"}]
["Total Fixed Expenses",{"$nulls":4},{"$f":"SUM(F55:F63)","v":{"v":208.16,"d":"$208.16"}},{"$f":"SUM(G55:G63)","v":{"v":136.16,"d":"$136.16"}},{"$f":"SUM(H55:H63)","v":{"v":72,"d":"$72.00"}}]
["Total Specified Expenses",{"$nulls":4},{"$f":"F51+F64","v":{"v":949.7321879585827,"d":"$949.73"}},{"$f":"G51+G64","v":{"v":790.1104602378043,"d":"$790.11"}},{"$f":"H51+H64","v":{"v":162.63635165869567,"d":"$162.64"}}]
["Returns Above Total Specified Expenses",{"$nulls":4},{"$f":"F12-F65","v":{"v":-4.732187958582699,"d":"($4.73)"}},{"$f":"G12-G65","v":{"v":-156.96046023780434,"d":"($156.96)"}},{"$f":"H12-H65","v":{"v":149.21364834130435,"d":"$149.21"}}]
[]
["Return on Investment",{"$nulls":4},{"$f":"(F66/F65)","v":{"v":-0.004982655130131345,"d":"-0.50%"}},{"$f":"(G66/G65)","v":{"v":-0.19865635013940078,"d":"-19.87%"}},{"v":0.9174680003548047,"d":"91.75%"}]

{"sheet":"Irr Sorghum","index":9,"n_rows":63,"n_cols":9,"rows_kept":63,"merged":[[1,0,1,7],[2,0,2,7],[3,0,3,7]]}
[]
[" Estimated Costs and Returns per Acre"]
["Irrigated Sorghum"]
["Projected for 2016"]
[{"$nulls":7},"Rental Agreement","Share"]
["Item ","Quantity","Unit","Price","Landlord"," ",null,"Share","Cash"]
[{"$nulls":4},"Share","Total","Tenant","Landlord"]
["Income"]
["sorghum grain",{"v":60,"d":"60.00"},"cwt",{"$f":"'Universal Input Prices'!$B$11","v":{"v":5.75,"d":"$5.75"}},{"v":0.33,"d":"33%"},{"$f":"D9*B9","v":{"v":345,"d":"$345.00"}},{"$f":"F9*(1-E9)","v":{"v":231.14999999999998,"d":"$231.15"}},{"$f":"IF(H6=\"Cash\", D57,F9*E9)","v":{"v":113.85000000000001,"d":"$113.85"}}]
["other income",{"v":0,"d":"0.00"},"$/ac.",{"v":1,"d":"$1.00"},{"v":0.33,"d":"33%"},{"$f":"D10*B10","v":{"v":0,"d":"$0.00"}},{"$f":"F10*(1-E10)","v":{"v":0,"d":"$0.00"}},{"$f":"IF(H7=\"Cash\", D59,F10*E10)","v":{"v":0,"d":"$0.00"}}]
[]
["Total Income",{"$nulls":4},{"$f":"SUM(F8:F11)","v":{"v":345,"d":"$345.00"}},{"$f":"SUM(G8:G11)","v":{"v":231.14999999999998,"d":"$231.15"}},{"$f":"SUM(H8:H11)","v":{"v":113.85000000000001,"d":"$113.85"}}]
[]
["Variable Costs"]
["Seed",{"v":4,"d":"4.0"},"lb",{"v":1.85,"d":"$1.850"},{"v":0,"d":"0%"},{"$f":"D15*B15","v":{"v":7.4,"d":"$7.40"}},{"$f":"F15*(1-E15)","v":{"v":7.4,"d":"$7.40"}},{"$f":"F15*E15","v":{"v":0,"d":"$0.00"}}]
["Fertilizer"]
["fert (N) - NH3 ",{"v":65,"d":"65.0"},"lb",{"$f":"IF(A17=\"\",0,VLOOKUP(A17,'Universal Input Prices'!$A$26:$B$30, 2))","v":{"v":0.25000000000000006,"d":"$0.250"}},{"v":0.33,"d":"33%"},{"$f":"D17*B17","v":{"v":16.250000000000004,"d":"$16.25"}},{"$f":"F17*(1-E17)","v":{"v":10.887500000000001,"d":"$10.89"}},{"$f":"F17*E17","v":{"v":5.362500000000002,"d":"$5.36"}}]
["fert (P) - liquid",{"v":30,"d":"30.0"},"lb",{"$f":"IF(A18=\"\",0,VLOOKUP(A18,'Universal Input Prices'!$A$26:$B$30, 2))","v":{"v":0.47,"d":"$0.470"}},{"v":0.33,"d":"33%"},{"$f":"D18*B18","v":{"v":14.1,"d":"$14.10"}},{"$f":"F18*(1-E18)","v":{"v":9.447,"d":"$9.45"}},{"$f":"F18*E18","v":{"v":4.6530000000000005,"d":"$4.65"}}]
["fert (N) - liquid",{"v":55,"d":"55.0"},"lb",{"$f":"IF(A19=\"\",0,VLOOKUP(A19,'Universal Input Prices'!$A$26:$B$27, 2))","v":{"v":0.41015625,"d":"$0.410"}},{"v":0.33,"d":"33%"},{"$f":"D19*B19","v":{"v":22.55859375,"d":"$22.56"}},{"$f":"F19*(1-E19)","v":{"v":15.114257812499998,"d":"$15.11"}},{"$f":"F19*E19","v":{"v":7.4443359375,"d":"$7.44"}}]
["Field Operations"]
["herbicide & application",{"v":1,"d":"1.0"},"acre",{"v":22.75,"d":"$22.75"},{"v":0.33,"d":"33%"},{"$f":"D21*B21","v":{"v":22.75,"d":"$22.75"}},{"$f":"F21*(1-E21)","v":{"v":15.242499999999998,"d":"$15.24"}},{"$f":"F21*E21","v":{"v":7.5075,"d":"$7.51"}}]
["fertilizer application",{"v":1,"d":"1.0"},"acre",{"v":15,"d":"$15.00"},{"v":0.33,"d":"33%"},{"v":15,"d":"$15.00"},{"v":10.049999999999999,"d":"$10.05"},{"v":4.95,"d":"$4.95"}]
["insecticide & application - headwrm",{"v":0.67,"d":"0.7"},"acre",{"v":9.8,"d":"$9.80"},{"v":0.33,"d":"33%"},{"v":6.566000000000001,"d":"$6.57"},{"v":4.39922,"d":"$4.40"},{"v":2.16678,"d":"$2.17"}]
["custom harvest & haul",{"$f":"B9","v":{"v":60,"d":"60.00"}},"cwt",{"v":0.85,"d":"$0.85"},{"v":0,"d":"0%"},{"v":51,"d":"$51.00"},{"v":51,"d":"$51.00"},{"v":0,"d":"$0.00"}]
["hoeing",{"v":1,"d":"1.0"},"acre",{"v":0,"d":"$0.00"},{"v":0,"d":"0%"},{"v":0,"d":"$0.00"},{"v":0,"d":"$0.00"},{"v":0,"d":"$0.00"}]
["scouting",{"v":1,"d":"1.0"},"acre",{"v":0,"d":"$0.00"},{"v":0,"d":"0%"},{"$f":"D26*B26","v":{"v":0,"d":"$0.00"}},{"$f":"F26*(1-E26)","v":{"v":0,"d":"$0.00"}},{"$f":"F26*E26","v":{"v":0,"d":"$0.00"}}]
["insecticide sugar cane aphid",{"v":1,"d":"1.0"},"acre",{"v":21,"d":"$21.00"},{"v":0.33,"d":"33%"},{"v":21,"d":"$21.00"},{"v":14.069999999999999,"d":"$14.07"},{"v":6.930000000000001,"d":"$6.93"}]
["other ",{"v":1,"d":"1.0"},"acre",{"v":0,"d":"$0.00"},{"v":0,"d":"0%"},{"v":0,"d":"$0.00"},{"v":0,"d":"$0.00"},{"v":0,"d":"$0.00"}]
["other ",{"v":1,"d":"1.0"},"acre",{"v":0,"d":"$0.00"},{"v":0,"d":"0%"},{"v":0,"d":"$0.00"},{"v":0,"d":"$0.00"},{"v":0,"d":"$0.00"}]
["Crop Insurance",{"v":1,"d":"1.0"},"acre",{"v":33,"d":"$33.00"},{"v":0.33,"d":"33%"},{"v":33,"d":"$33.00"},{"v":22.11,"d":"$22.11"},{"v":10.89,"d":"$10.89"}]
["Operator Labor & Hand Labor",{"v":0.695,"d":"0.70"},"hours",{"$f":"'Universal Input Prices'!$B$31","v":{"v":12.45,"d":"$12.45"}},{"v":0,"d":"0%"},{"v":8.65275,"d":"$8.65"},{"v":8.65275,"d":"$8.65"},{"v":0,"d":"$0.00"}]
["Irrigation Labor",{"v":0.896,"d":"0.90"},"hours",{"$f":"'Universal Input Prices'!$B$31","v":{"v":12.45,"d":"$12.45"}},{"v":0,"d":"0%"},{"v":11.155199999999999,"d":"$11.16"},{"v":11.155199999999999,"d":"$11.16"},{"v":0,"d":"$0.00"}]
["Diesel Fuel - Tractors",1.91,"gallons",{"$f":"'Universal Input Prices'!$B$32","v":{"v":1.81,"d":"$1.81"}},{"v":0,"d":"0%"},{"v":3.4571,"d":"$3.46"},{"v":3.4571,"d":"$3.46"},{"v":0,"d":"$0.00"}]
["Gasoline - Pickup",{"v":2.0492308,"d":"2.05"},"gallons",{"$f":"'Universal Input Prices'!$B$33","v":{"v":1.926,"d":"$1.93"}},{"v":0,"d":"0%"},{"v":3.9468185208,"d":"$3.95"},{"v":3.9468185208,"d":"$3.95"},{"v":0,"d":"$0.00"}]
["Irrigation Fuel",{"v":10,"d":"10.00"},"acin",{"$f":"'Universal Input Prices'!$B$34","v":{"v":3.6,"d":"$3.60"}},{"v":0.33,"d":"33%"},{"v":36,"d":"$36.00"},{"v":24.119999999999997,"d":"$24.12"},{"v":11.88,"d":"$11.88"}]
["Pumping Days",75.43]
["Calculated GPM capacity per acre needed",{"$f":"B35*18.85694/B36","v":{"v":2.4999257589818376,"d":"2.50"}}]
["Repair & Maintenance"]
["Implements",{"v":1,"d":"1.00"},"acre",{"v":12.35,"d":"$12.35"},{"v":0,"d":"0%"},{"$f":"D39*B39","v":{"v":12.35,"d":"$12.35"}},{"$f":"F39*(1-E39)","v":{"v":12.35,"d":"$12.35"}},{"$f":"F39*E39","v":{"v":0,"d":"$0.00"}}]
["Tractors",{"v":1,"d":"1.00"},"acre",{"v":3.67,"d":"$3.67"},{"v":0,"d":"0%"},{"$f":"D40*B40","v":{"v":3.67,"d":"$3.67"}},{"$f":"F40*(1-E40)","v":{"v":3.67,"d":"$3.67"}},{"$f":"F40*E40","v":{"v":0,"d":"$0.00"}}]
["Irrigation-Above Ground",{"$f":"Sorghum_Inches","v":{"v":10,"d":"10.00"}},"acin",{"v":4.04,"d":"$4.04"},{"v":0,"d":"0%"},{"$f":"D41*B41","v":{"v":40.4,"d":"$40.40"}},{"$f":"F41*(1-E41)","v":{"v":40.4,"d":"$40.40"}},{"$f":"F41*E41","v":{"v":0,"d":"$0.00"}}]
["Self Propelled Equipment",{"v":1,"d":"1.00"},"acre",{"v":0,"d":"$0.00"},{"v":1,"d":"100%"},{"$f":"D42*B42","v":{"v":0,"d":"$0.00"}},{"$f":"F42*(1-E42)","v":{"v":0,"d":"$0.00"}},{"$f":"F42*E42","v":{"v":0,"d":"$0.00"}}]
["Pickup",{"v":1,"d":"1.00"},"acre",{"v":2.51,"d":"$2.51"},{"v":0,"d":"0%"},{"$f":"D43*B43","v":{"v":2.51,"d":"$2.51"}},{"$f":"F43*(1-E43)","v":{"v":2.51,"d":"$2.51"}},{"$f":"F43*E43","v":{"v":0,"d":"$0.00"}}]
["Interest-operating capital",{"$f":"'Universal Input Prices'!$B$35","v":{"v":0.054,"d":"5.40%"}},{"$nulls":3},{"$f":"(SUM(F15:F23,F25:F43))*$B44/2.5","v":{"v":6.06455558504928,"d":"$6.06"}},{"$f":"(SUM(G15:G23,G25:G43))*$B44/2","v":{"v":5.912523350999099,"d":"$5.91"}},{"v":1.6681711303125002,"d":"$1.67"}]
[]
["Total Variable Costs",{"$nulls":4},{"$f":"SUM(F15:F44)","v":{"v":337.83101785584927,"d":"$337.83"}},{"$f":"SUM(G15:G44)","v":{"v":275.89486968429907,"d":"$275.89"}},{"$f":"SUM(H15:H44)","v":{"v":63.452287067812506,"d":"$63.45"}}]
["Returns Above Variable Costs",{"$nulls":4},{"$f":"F12-F46","v":{"v":7.168982144150732,"d":"$7.17"}},{"$f":"G12-G46","v":{"v":-44.74486968429909,"d":"($44.74)"}},{"$f":"H12-H46","v":{"v":50.3977129321875,"d":"$50.40"}}]
[]
["Fixed Costs"]
["Implements",{"v":1,"d":"1.00"},"acre",{"v":19.23,"d":"$19.23"},{"v":0,"d":"0%"},{"$f":"D50*B50","v":{"v":19.23,"d":"$19.23"}},{"$f":"F50*(1-E50)","v":{"v":19.23,"d":"$19.23"}},{"$f":"F50*E50","v":{"v":0,"d":"$0.00"}}]
["Tractors",{"v":1,"d":"1.00"},"acre",{"v":5.14,"d":"$5.14"},{"v":0,"d":"0%"},{"v":5.14,"d":"$5.14"},{"v":5.14,"d":"$5.14"},{"v":0,"d":"$0.00"}]
["Irrigation Equipment",{"v":1,"d":"1.00"},"acre",{"v":47.34,"d":"$47.34"},{"v":0,"d":"0%"},{"v":47.34,"d":"$47.34"},{"v":47.34,"d":"$47.34"},{"v":0,"d":"$0.00"}]
["Self Propelled Equipment",{"v":1,"d":"1.00"},"acre",{"v":0,"d":"$0.00"},{"v":1,"d":"100%"},{"v":0,"d":"$0.00"},{"v":0,"d":"$0.00"},{"v":0,"d":"$0.00"}]
["Pickup",{"v":1,"d":"1.00"},"acre",{"v":3.66,"d":"$3.66"},{"v":0,"d":"0%"},{"v":3.66,"d":"$3.66"},{"v":3.66,"d":"$3.66"},{"v":0,"d":"$0.00"}]
["Management",{"v":1,"d":"1.00"},"acre",{"v":0,"d":"$0.00"},{"v":0,"d":"0%"},{"v":0,"d":"$0.00"},{"v":0,"d":"$0.00"},{"v":0,"d":"$0.00"}]
["Irrigation Investment",{"v":1,"d":"1.00"},"acre",{"v":32.3,"d":"$32.30"},{"v":0,"d":"0%"},{"$f":"B56*D56","v":{"v":32.3,"d":"$32.30"}},{"v":32.3,"d":"$32.30"},{"v":0,"d":"$0.00"}]
["Land",{"v":1,"d":"1.00"},"acre",{"v":72,"d":"$72.00"},{"v":1,"d":"100%"},{"$f":"D57*B57","v":{"v":72,"d":"$72.00"}},{"$f":"IF($H$6=\"Cash\",D57,F57*(1-E57))","v":{"v":0,"d":"$0.00"}},{"$f":"IF($H$6=\"Cash\",0,F57*E57)","v":{"v":72,"d":"$72.00"}}]
["Property Tax",{"v":1,"d":"1.00"},"acre",{"v":0,"d":"$0.00"},{"v":1,"d":"100%"},{"$f":"B58*D58","v":{"v":0,"d":"$0.00"}},{"v":0,"d":"$0.00"},{"v":0,"d":"$0.00"}]
["Total Fixed Expenses",{"$nulls":4},{"$f":"SUM(F50:F58)","v":{"v":179.67000000000002,"d":"$179.67"}},{"$f":"SUM(G50:G58)","v":{"v":107.67,"d":"$107.67"}},{"$f":"SUM(H50:H58)","v":{"v":72,"d":"$72.00"}}]
["Total Specified Expenses",{"$nulls":4},{"$f":"F46+F59","v":{"v":517.5010178558493,"d":"$517.50"}},{"$f":"G46+G59","v":{"v":383.5648696842991,"d":"$383.56"}},{"$f":"H46+H59","v":{"v":135.4522870678125,"d":"$135.45"}}]
["Returns Above Total Specified Expenses",{"$nulls":4},{"$f":"F12-F60","v":{"v":-172.50101785584934,"d":"($172.50)"}},{"$f":"G12-G60","v":{"v":-152.4148696842991,"d":"($152.41)"}},{"$f":"H12-H60","v":{"v":-21.602287067812497,"d":"($21.60)"}}]
[]
["Return on Investment",{"$nulls":4},{"$f":"(F61/F60)","v":{"v":-0.33333464457822526,"d":"-33.33%"}},{"$f":"(G61/G60)","v":{"v":-0.39736399688988017,"d":"-39.74%"}},{"v":-0.1594826306402459,"d":"-15.95%"}]

{"sheet":"Irr Sorghum Seed","index":10,"n_rows":63,"n_cols":9,"rows_kept":63,"merged":[[1,0,1,7],[2,0,2,7],[3,0,3,7]]}
[]
[" Estimated Costs and Returns per Acre"]
["Irrigated Sorghum Seed "]
["Projected for 2016"]
[{"$nulls":7},"Rental Agreement","Share"]
["Item ","Quantity","Unit","Price","Landlord"," ",null,"Share","Cash"]
[{"$nulls":4},"Share","Total","Tenant","Landlord"]
["Income"]
["seed sorghum",{"v":45,"d":"45.00"},"cwt",{"$f":"'Universal Input Prices'!B12","v":{"v":16.9,"d":"$16.90"}},{"v":0.33,"d":"33%"},{"$f":"D9*B9","v":{"v":760.4999999999999,"d":"$760.50"}},{"$f":"F9*(1-E9)","v":{"v":509.53499999999985,"d":"$509.54"}},{"$f":"IF(H6=\"Cash\", D57,F9*E9)","v":{"v":250.96499999999997,"d":"$250.97"}}]
["other income",{"v":0,"d":"0.00"},"$/ac.",{"v":1,"d":"$1.00"},{"v":0.33,"d":"33%"},{"$f":"D10*B10","v":{"v":0,"d":"$0.00"}},{"$f":"F10*(1-E10)","v":{"v":0,"d":"$0.00"}},{"$f":"IF(H7=\"Cash\", D59,F10*E10)","v":{"v":0,"d":"$0.00"}}]
[]
["Total Income",{"$nulls":4},{"$f":"SUM(F8:F11)","v":{"v":760.4999999999999,"d":"$760.50"}},{"$f":"SUM(G8:G11)","v":{"v":509.53499999999985,"d":"$509.54"}},{"$f":"SUM(H8:H11)","v":{"v":250.96499999999997,"d":"$250.97"}}]
[]
["Variable Costs"]
["Seed",{"v":0,"d":"0.0"},"lb",{"v":1.916,"d":"$1.916"},{"v":0,"d":"0%"},{"$f":"D15*B15","v":{"v":0,"d":"$0.00"}},{"$f":"F15*(1-E15)","v":{"v":0,"d":"$0.00"}},{"$f":"F15*E15","v":{"v":0,"d":"$0.00"}}]
["Fertilizer"]
["fert (N) - NH3 ",{"v":65,"d":"65.0"},"lb",{"$f":"IF(A17=\"\",0,VLOOKUP(A17,'Universal Input Prices'!$A$26:$B$30, 2))","v":{"v":0.25000000000000006,"d":"$0.250"}},{"v":0.33,"d":"33%"},{"$f":"D17*B17","v":{"v":16.250000000000004,"d":"$16.25"}},{"$f":"F17*(1-E17)","v":{"v":10.887500000000001,"d":"$10.89"}},{"$f":"F17*E17","v":{"v":5.362500000000002,"d":"$5.36"}}]
["fert (P) - liquid",{"v":50,"d":"50.0"},"lb",{"$f":"IF(A18=\"\",0,VLOOKUP(A18,'Universal Input Prices'!$A$26:$B$30, 2))","v":{"v":0.47,"d":"$0.470"}},{"v":0.33,"d":"33%"},{"$f":"D18*B18","v":{"v":23.5,"d":"$23.50"}},{"$f":"F18*(1-E18)","v":{"v":15.744999999999997,"d":"$15.75"}},{"$f":"F18*E18","v":{"v":7.755000000000001,"d":"$7.76"}}]
["fert (N) - liquid",{"v":60,"d":"60.0"},"lb",{"$f":"IF(A19=\"\",0,VLOOKUP(A19,'Universal Input Prices'!$A$26:$B$30, 2))","v":{"v":0.41015625,"d":"$0.410"}},{"v":0.33,"d":"33%"},{"$f":"D19*B19","v":{"v":24.609375,"d":"$24.61"}},{"$f":"F19*(1-E19)","v":{"v":16.48828125,"d":"$16.49"}},{"$f":"F19*E19","v":{"v":8.12109375,"d":"$8.12"}}]
["Field Operations"]
["herbicide & application",{"v":1,"d":"1.0"},"acre",{"v":22.57,"d":"$22.57"},{"v":0.33,"d":"33%"},{"$f":"D21*B21","v":{"v":22.57,"d":"$22.57"}},{"$f":"F21*(1-E21)","v":{"v":15.121899999999998,"d":"$15.12"}},{"$f":"F21*E21","v":{"v":7.4481,"d":"$7.45"}}]
["fertilizer application",{"v":1,"d":"1.0"},"acre",{"v":15,"d":"$15.00"},{"v":0.33,"d":"33%"},{"v":15,"d":"$15.00"},{"v":10.049999999999999,"d":"$10.05"},{"v":4.95,"d":"$4.95"}]
["insecticide & application-headwrm",{"v":0.67,"d":"0.7"},"acre",{"v":9.8,"d":"$9.80"},{"v":0.33,"d":"33%"},{"v":6.566000000000001,"d":"$6.57"},{"v":4.39922,"d":"$4.40"},{"v":2.16678,"d":"$2.17"}]
["custom harvest & haul",{"$f":"B9","v":{"v":45,"d":"45.00"}},"cwt",{"v":0.85,"d":"$0.85"},{"v":0,"d":"0%"},{"v":38.25,"d":"$38.25"},{"v":38.25,"d":"$38.25"},{"v":0,"d":"$0.00"}]
["hoeing",{"v":1,"d":"1.0"},"acre",{"v":0,"d":"$0.00"},{"v":0,"d":"0%"},{"v":0,"d":"$0.00"},{"v":0,"d":"$0.00"},{"v":0,"d":"$0.00"}]
["scouting",{"v":1,"d":"1.0"},"acre",{"v":0,"d":"$0.00"},{"v":0,"d":"0%"},{"$f":"D26*B26","v":{"v":0,"d":"$0.00"}},{"$f":"F26*(1-E26)","v":{"v":0,"d":"$0.00"}},{"$f":"F26*E26","v":{"v":0,"d":"$0.00"}}]
["insecticide sugar cane aphid",{"v":1,"d":"1.0"},"acre",{"v":21,"d":"$21.00"},{"v":0.33,"d":"33%"},{"v":21,"d":"$21.00"},{"v":14.069999999999999,"d":"$14.07"},{"v":6.930000000000001,"d":"$6.93"}]
["other ",{"v":1,"d":"1.0"},"acre",{"v":0,"d":"$0.00"},{"v":0,"d":"0%"},{"v":0,"d":"$0.00"},{"v":0,"d":"$0.00"},{"v":0,"d":"$0.00"}]
["other ",{"v":1,"d":"1.0"},"acre",{"v":0,"d":"$0.00"},{"v":0,"d":"0%"},{"v":0,"d":"$0.00"},{"v":0,"d":"$0.00"},{"v":0,"d":"$0.00"}]
["Crop Insurance",{"v":1,"d":"1.0"},"acre",{"v":33,"d":"$33.00"},{"v":0.33,"d":"33%"},{"v":33,"d":"$33.00"},{"v":22.11,"d":"$22.11"},{"v":10.89,"d":"$10.89"}]
["Operator Labor & Hand Labor",{"v":0.695,"d":"0.70"},"hours",{"$f":"'Universal Input Prices'!$B$31","v":{"v":12.45,"d":"$12.45"}},{"v":0,"d":"0%"},{"v":8.65275,"d":"$8.65"},{"v":8.65275,"d":"$8.65"},{"v":0,"d":"$0.00"}]
["Irrigation Labor",{"v":1.024,"d":"1.02"},"hours",{"$f":"'Universal Input Prices'!$B$31","v":{"v":12.45,"d":"$12.45"}},{"v":0,"d":"0%"},{"v":12.7488,"d":"$12.75"},{"v":12.7488,"d":"$12.75"},{"v":0,"d":"$0.00"}]
["Diesel Fuel - Tractors",1.91,"gallons",{"$f":"'Universal Input Prices'!$B$32","v":{"v":1.81,"d":"$1.81"}},{"v":0,"d":"0%"},{"v":3.4571,"d":"$3.46"},{"v":3.4571,"d":"$3.46"},{"v":0,"d":"$0.00"}]
["Gasoline - Pickup",{"v":2.0485,"d":"2.05"},"gallons",{"$f":"'Universal Input Prices'!$B$33","v":{"v":1.926,"d":"$1.93"}},{"v":0,"d":"0%"},{"v":3.9454110000000004,"d":"$3.95"},{"v":3.9454110000000004,"d":"$3.95"},{"v":0,"d":"$0.00"}]
["Irrigation Fuel",{"v":16,"d":"16.00"},"acin",{"$f":"'Universal Input Prices'!$B$34","v":{"v":3.6,"d":"$3.60"}},{"v":0.33,"d":"33%"},{"v":57.6,"d":"$57.60"},{"v":38.592,"d":"$38.59"},{"v":19.008000000000003,"d":"$19.01"}]
["Pumping Days",98.06]
["Calculated GPM capacity per acre needed",{"$f":"B35*18.85694/B36","v":{"v":3.076800326330818,"d":"3.08"}}]
["Repair & Maintenance"]
["Implements",{"v":1,"d":"1.00"},"acre",{"v":12.35,"d":"$12.35"},{"v":0,"d":"0%"},{"$f":"D39*B39","v":{"v":12.35,"d":"$12.35"}},{"$f":"F39*(1-E39)","v":{"v":12.35,"d":"$12.35"}},{"$f":"F39*E39","v":{"v":0,"d":"$0.00"}}]
["Tractors",{"v":1,"d":"1.00"},"acre",{"v":3.67,"d":"$3.67"},{"v":0,"d":"0%"},{"$f":"D40*B40","v":{"v":3.67,"d":"$3.67"}},{"$f":"F40*(1-E40)","v":{"v":3.67,"d":"$3.67"}},{"$f":"F40*E40","v":{"v":0,"d":"$0.00"}}]
["Irrigation-Above Ground",{"$f":"Sorghum_Seed_Inches","v":{"v":16,"d":"16.00"}},"acin",{"v":4.04,"d":"$4.04"},{"v":0,"d":"0%"},{"$f":"D41*B41","v":{"v":64.64,"d":"$64.64"}},{"$f":"F41*(1-E41)","v":{"v":64.64,"d":"$64.64"}},{"$f":"F41*E41","v":{"v":0,"d":"$0.00"}}]
["Self Propelled Equipment",{"v":1,"d":"1.00"},"acre",{"v":0,"d":"$0.00"},{"v":1,"d":"100%"},{"$f":"D42*B42","v":{"v":0,"d":"$0.00"}},{"$f":"F42*(1-E42)","v":{"v":0,"d":"$0.00"}},{"$f":"F42*E42","v":{"v":0,"d":"$0.00"}}]
["Pickup",{"v":1,"d":"1.00"},"acre",{"v":2.51,"d":"$2.51"},{"v":0,"d":"0%"},{"$f":"D43*B43","v":{"v":2.51,"d":"$2.51"}},{"$f":"F43*(1-E43)","v":{"v":2.51,"d":"$2.51"}},{"$f":"F43*E43","v":{"v":0,"d":"$0.00"}}]
["Interest-operating capital",{"$f":"'Universal Input Prices'!$B$35","v":{"v":0.054,"d":"5.40%"}},{"$nulls":3},{"$f":"(SUM(F15:F23,F25:F43))*$B44/2.6","v":{"v":6.896826747692307,"d":"$6.90"}},{"$f":"(SUM(G15:G23,G25:G43))*$B44/2","v":{"v":7.004824980749999,"d":"$7.00"}},{"$f":"(SUM(H15:H23,H25:H43))*$B44/2","v":{"v":1.9610497912500002,"d":"$1.96"}}]
[]
["Total Variable Costs",{"$nulls":4},{"$f":"SUM(F15:F44)","v":{"v":377.2162627476923,"d":"$377.22"}},{"$f":"SUM(G15:G44)","v":{"v":304.69278723074996,"d":"$304.69"}},{"$f":"SUM(H15:H44)","v":{"v":74.59252354125002,"d":"$74.59"}}]
["Returns Above Variable Costs",{"$nulls":4},{"$f":"F12-F46","v":{"v":383.28373725230756,"d":"$383.28"}},{"$f":"G12-G46","v":{"v":204.8422127692499,"d":"$204.84"}},{"$f":"H12-H46","v":{"v":176.37247645874996,"d":"$176.37"}}]
[]
["Fixed Costs"]
["Implements",{"v":1,"d":"1.00"},"acre",{"v":19.23,"d":"$19.23"},{"v":0,"d":"0%"},{"$f":"D50*B50","v":{"v":19.23,"d":"$19.23"}},{"$f":"F50*(1-E50)","v":{"v":19.23,"d":"$19.23"}},{"$f":"F50*E50","v":{"v":0,"d":"$0.00"}}]
["Tractors",{"v":1,"d":"1.00"},"acre",{"v":5.14,"d":"$5.14"},{"v":0,"d":"0%"},{"v":5.14,"d":"$5.14"},{"v":5.14,"d":"$5.14"},{"v":0,"d":"$0.00"}]
["Irrigation Equipment",{"v":1,"d":"1.00"},"acre",{"v":40.42,"d":"$40.42"},{"v":0,"d":"0%"},{"v":40.42,"d":"$40.42"},{"v":40.42,"d":"$40.42"},{"v":0,"d":"$0.00"}]
["Self Propelled Equipment",{"v":1,"d":"1.00"},"acre",{"v":0,"d":"$0.00"},{"v":1,"d":"100%"},{"v":0,"d":"$0.00"},{"v":0,"d":"$0.00"},{"v":0,"d":"$0.00"}]
["Pickup",{"v":1,"d":"1.00"},"acre",{"v":3.66,"d":"$3.66"},{"v":0,"d":"0%"},{"v":3.66,"d":"$3.66"},{"v":3.66,"d":"$3.66"},{"v":0,"d":"$0.00"}]
["Management",{"v":1,"d":"1.00"},"acre",{"v":0,"d":"$0.00"},{"v":0,"d":"0%"},{"v":0,"d":"$0.00"},{"v":0,"d":"$0.00"},{"v":0,"d":"$0.00"}]
["Irrigation Investment",{"v":1,"d":"1.00"},"acre",{"v":29.44,"d":"$29.44"},{"v":0,"d":"0%"},{"$f":"B56*D56","v":{"v":29.44,"d":"$29.44"}},{"v":29.44,"d":"$29.44"},{"v":0,"d":"$0.00"}]
["Land",{"v":1,"d":"1.00"},"acre",{"v":72,"d":"$72.00"},{"v":1,"d":"100%"},{"$f":"D57*B57","v":{"v":72,"d":"$72.00"}},{"$f":"IF($H$6=\"Cash\",D57,F57*(1-E57))","v":{"v":0,"d":"$0.00"}},{"$f":"IF($H$6=\"Cash\",0,F57*E57)","v":{"v":72,"d":"$72.00"}}]
["Property Tax",{"v":1,"d":"1.00"},"acre",{"v":0,"d":"$0.00"},{"v":1,"d":"100%"},{"$f":"B58*D58","v":{"v":0,"d":"$0.00"}},{"v":0,"d":"$0.00"},{"v":0,"d":"$0.00"}]
["Total Fixed Expenses",{"$nulls":4},{"$f":"SUM(F50:F58)","v":{"v":169.89,"d":"$169.89"}},{"$f":"SUM(G50:G58)","v":{"v":97.89,"d":"$97.89"}},{"$f":"SUM(H50:H58)","v":{"v":72,"d":"$72.00"}}]
["Total Specified Expenses",{"$nulls":4},{"$f":"F46+F59","v":{"v":547.1062627476923,"d":"$547.11"}},{"$f":"G46+G59","v":{"v":402.58278723074994,"d":"$402.58"}},{"$f":"H46+H59","v":{"v":146.59252354125002,"d":"$146.59"}}]
["Returns Above Total Specified Expenses",{"$nulls":4},{"$f":"F12-F60","v":{"v":213.39373725230757,"d":"$213.39"}},{"$f":"G12-G60","v":{"v":106.95221276924991,"d":"$106.95"}},{"$f":"H12-H60","v":{"v":104.37247645874996,"d":"$104.37"}}]
[]
["Return on Investment",{"$nulls":4},{"$f":"(F61/F60)","v":{"v":0.3900407503664747,"d":"39.00%"}},{"$f":"(G61/G60)","v":{"v":0.265665140591189,"d":"26.57%"}},{"v":0.7119904476532212,"d":"71.20%"}]

{"sheet":"Irr Sorghum Silage","index":11,"n_rows":63,"n_cols":9,"rows_kept":63,"merged":[[1,0,1,7],[2,0,2,7],[3,0,3,7]]}
[]
[" Estimated Costs and Returns per Acre"]
["Irrigated Sorghum Silage"]
["Projected for 2016"]
[{"$nulls":7},"Rental Agreement","Share"]
["Item ","Quantity","Unit","Price","Landlord"," ",null,"Share","Cash"]
[{"$nulls":4},"Share","Total","Tenant","Landlord"]
["Income"]
["sorghum silage",{"v":21,"d":"21.00"},"ton",{"$f":"'Universal Input Prices'!$B$13","v":{"v":31.6,"d":"$31.60"}},{"v":0.33,"d":"33%"},{"$f":"D9*B9","v":{"v":663.6,"d":"$663.60"}},{"$f":"F9*(1-E9)","v":{"v":444.61199999999997,"d":"$444.61"}},{"$f":"IF(H6=\"Cash\", D57,F9*E9)","v":{"v":218.98800000000003,"d":"$218.99"}}]
["other income",{"v":0,"d":"0.00"},"$/ac.",{"v":1,"d":"$1.00"},{"v":0.33,"d":"33%"},{"$f":"D10*B10","v":{"v":0,"d":"$0.00"}},{"$f":"F10*(1-E10)","v":{"v":0,"d":"$0.00"}},{"$f":"IF(H7=\"Cash\", D59,F10*E10)","v":{"v":0,"d":"$0.00"}}]
[]
["Total Income",{"$nulls":4},{"$f":"SUM(F7:F11)","v":{"v":663.6,"d":"$663.60"}},{"$f":"SUM(G7:G11)","v":{"v":444.61199999999997,"d":"$444.61"}},{"$f":"SUM(H7:H11)","v":{"v":218.98800000000003,"d":"$218.99"}}]
[]
["Variable Costs"]
["Seed",{"v":5,"d":"5.00"},"lb",{"v":1.85,"d":"$1.85"},{"v":0,"d":"0%"},{"$f":"D15*B15","v":{"v":9.25,"d":"$9.25"}},{"$f":"F15*(1-E15)","v":{"v":9.25,"d":"$9.25"}},{"$f":"F15*E15","v":{"v":0,"d":"$0.00"}}]
["Fertilizer"]
["fert (P) - dry",{"v":60,"d":"60.0"},"lb",{"$f":"IF(A17=\"\",0,VLOOKUP(A17,'Universal Input Prices'!$A$26:$B$30, 2))","v":{"v":0.42980769230769234,"d":"$0.430"}},{"v":0.33,"d":"33%"},{"$f":"D17*B17","v":{"v":25.78846153846154,"d":"$25.79"}},{"$f":"F17*(1-E17)","v":{"v":17.27826923076923,"d":"$17.28"}},{"$f":"F17*E17","v":{"v":8.510192307692309,"d":"$8.51"}}]
["fert (N) - NH3 ",{"v":150,"d":"150.0"},"lb",{"$f":"IF(A18=\"\",0,VLOOKUP(A18,'Universal Input Prices'!$A$26:$B$30, 2))","v":{"v":0.25000000000000006,"d":"$0.250"}},{"v":0.33,"d":"33%"},{"$f":"D18*B18","v":{"v":37.50000000000001,"d":"$37.50"}},{"$f":"F18*(1-E18)","v":{"v":25.125000000000004,"d":"$25.13"}},{"$f":"F18*E18","v":{"v":12.375000000000004,"d":"$12.38"}}]
[null,{"v":0,"d":"0.0"},"lb",{"$f":"IF(A19=\"\",0,VLOOKUP(A19,'Universal Input Prices'!$A$26:$B$30, 2))","v":{"v":0,"d":"$0.000"}},{"v":0,"d":"0%"},{"$f":"D19*B19","v":{"v":0,"d":"$0.00"}},{"$f":"F19*(1-E19)","v":{"v":0,"d":"$0.00"}},{"$f":"F19*E19","v":{"v":0,"d":"$0.00"}}]
["Field Operations"]
["herbicide & application",{"v":1,"d":"1.0"},"acre",{"v":12.1,"d":"$12.10"},{"v":0.33,"d":"33%"},{"$f":"D21*B21","v":{"v":12.1,"d":"$12.10"}},{"$f":"F21*(1-E21)","v":{"v":8.107,"d":"$8.11"}},{"$f":"F21*E21","v":{"v":3.993,"d":"$3.99"}}]
["fertilizer application",{"v":1,"d":"1.0"},"acre",{"v":20,"d":"$20.00"},{"v":0.33,"d":"33%"},{"v":20,"d":"$20.00"},{"v":13.399999999999999,"d":"$13.40"},{"v":6.6000000000000005,"d":"$6.60"}]
["insecticide & application - headwrm",{"v":0.33,"d":"0.3"},"acre",{"v":9.79,"d":"$9.79"},{"v":0.33,"d":"33%"},{"v":3.2306999999999997,"d":"$3.23"},{"v":2.1645689999999997,"d":"$2.16"},{"v":1.066131,"d":"$1.07"}]
["custom harvest & haul",{"$f":"$B$9","v":{"v":21,"d":"21.00"}},"ton",{"v":9,"d":"$9.00"},{"v":0,"d":"0%"},{"v":189,"d":"$189.00"},{"v":189,"d":"$189.00"},{"v":0,"d":"$0.00"}]
["crop consultant",{"v":1,"d":"1.0"},"acre",{"v":0,"d":"$0.00"},{"v":0,"d":"0%"},{"v":0,"d":"$0.00"},{"v":0,"d":"$0.00"},{"v":0,"d":"$0.00"}]
["insecticide sugar cane aphid",{"v":1,"d":"1.0"},"acre",{"v":21,"d":"$21.00"},{"v":0.33,"d":"33%"},{"$f":"D26*B26","v":{"v":21,"d":"$21.00"}},{"$f":"F26*(1-E26)","v":{"v":14.069999999999999,"d":"$14.07"}},{"$f":"F26*E26","v":{"v":6.930000000000001,"d":"$6.93"}}]
["other ",{"v":1,"d":"1.0"},"acre",{"v":0,"d":"$0.00"},{"v":0,"d":"0%"},{"v":0,"d":"$0.00"},{"v":0,"d":"$0.00"},{"v":0,"d":"$0.00"}]
["other ",{"v":1,"d":"1.0"},"acre",{"v":0,"d":"$0.00"},{"v":0,"d":"0%"},{"v":0,"d":"$0.00"},{"v":0,"d":"$0.00"},{"v":0,"d":"$0.00"}]
["other ",{"v":1,"d":"1.0"},"acre",{"v":0,"d":"$0.00"},{"v":0,"d":"0%"},{"v":0,"d":"$0.00"},{"v":0,"d":"$0.00"},{"v":0,"d":"$0.00"}]
["Crop Insurance",{"v":1,"d":"1.0"},"acre",{"v":33,"d":"$33.00"},{"v":0.33,"d":"33%"},{"v":33,"d":"$33.00"},{"v":22.11,"d":"$22.11"},{"v":10.89,"d":"$10.89"}]
["Operator Labor & Hand Labor",{"v":0.785,"d":"0.8"},"hour",{"$f":"'Universal Input Prices'!$B$31","v":{"v":12.45,"d":"$12.45"}},{"v":0,"d":"0%"},{"v":9.773249999999999,"d":"$9.77"},{"v":9.773249999999999,"d":"$9.77"},{"v":0,"d":"$0.00"}]
["Irrigation Labor",{"v":0.832,"d":"0.83"},"hours",{"$f":"'Universal Input Prices'!$B$31","v":{"v":12.45,"d":"$12.45"}},{"v":0,"d":"0%"},{"v":10.3584,"d":"$10.36"},{"v":10.3584,"d":"$10.36"},{"v":0,"d":"$0.00"}]
["Diesel Fuel - Tractors",2.04,"gallons",{"$f":"'Universal Input Prices'!$B$32","v":{"v":1.81,"d":"$1.81"}},{"v":0,"d":"0%"},{"v":3.6924,"d":"$3.69"},{"v":3.6924,"d":"$3.69"},{"v":0,"d":"$0.00"}]
["Gasoline - Pickup",{"v":3.073846154,"d":"3.07"},"gallons",{"$f":"'Universal Input Prices'!$B$33","v":{"v":1.926,"d":"$1.93"}},{"v":0,"d":"0%"},{"v":5.920227692604,"d":"$5.92"},{"v":5.920227692604,"d":"$5.92"},{"v":0,"d":"$0.00"}]
["Irrigation Fuel",{"v":13,"d":"13.00"},"acin",{"$f":"'Universal Input Prices'!$B$34","v":{"v":3.6,"d":"$3.60"}},{"v":0.33,"d":"33%"},{"v":46.800000000000004,"d":"$46.80"},{"v":31.355999999999998,"d":"$31.36"},{"v":15.444000000000003,"d":"$15.44"}]
["Pumping Days",70.04]
["Calculated GPM capacity per acre needed",{"$f":"B35*18.85694/B36","v":{"v":3.5000031410622503,"d":"3.50"}}]
["Repair & Maintenance",{"$nulls":5},{"v":0,"d":"$0.00"},{"v":0,"d":"$0.00"}]
["Implements",{"v":1,"d":"1.00"},"acre",{"v":13.18,"d":"$13.18"},{"v":0,"d":"0%"},{"$f":"D39*B39","v":{"v":13.18,"d":"$13.18"}},{"v":13.18,"d":"$13.18"},{"v":0,"d":"$0.00"}]
["Tractors",{"v":1,"d":"1.00"},"acre",{"v":3.62,"d":"$3.62"},{"v":0,"d":"0%"},{"$f":"D40*B40","v":{"v":3.62,"d":"$3.62"}},{"v":3.62,"d":"$3.62"},{"v":0,"d":"$0.00"}]
["Irrigation-Above Ground",{"$f":"B35","v":{"v":13,"d":"13.00"}},"acin",{"v":4.04,"d":"$4.04"},{"v":0,"d":"0%"},{"$f":"D41*B41","v":{"v":52.52,"d":"$52.52"}},{"v":52.52,"d":"$52.52"},{"v":0,"d":"$0.00"}]
["Self Propelled Equipment",{"v":1,"d":"1.00"},"acre",{"v":0,"d":"$0.00"},{"v":1,"d":"100%"},{"$f":"D42*B42","v":{"v":0,"d":"$0.00"}},{"v":0,"d":"$0.00"},{"v":0,"d":"$0.00"}]
["Pickup",{"v":1,"d":"1.00"},"acre",{"v":3.76,"d":"$3.76"},{"v":0,"d":"0%"},{"$f":"D43*B43","v":{"v":3.76,"d":"$3.76"}},{"v":3.76,"d":"$3.76"},{"v":0,"d":"$0.00"}]
["Interest-operating capital",{"$f":"'Universal Input Prices'!$B$35","v":{"v":0.054,"d":"5.40%"}},{"$nulls":3},{"$f":"(SUM(F15:F23,F25:F43))*$B44/2.4","v":{"v":7.008602382698974,"d":"$7.01"}},{"$f":"(SUM(G15:G23,G25:G43))*$B44/2","v":{"v":6.633498129931077,"d":"$6.63"}},{"v":1.7768247293076926,"d":"$1.78"}]
[]
["Total Variable Costs",{"$nulls":4},{"$f":"SUM(F15:F44)","v":{"v":507.50204161376456,"d":"$507.50"}},{"$f":"SUM(G15:G44)","v":{"v":441.3186140533043,"d":"$441.32"}},{"$f":"SUM(H15:H44)","v":{"v":67.58514803700001,"d":"$67.59"}}]
["Returns Above Variable Costs",{"$nulls":4},{"$f":"F12-F46","v":{"v":156.09795838623546,"d":"$156.10"}},{"$f":"G12-G46","v":{"v":3.2933859466956505,"d":"$3.29"}},{"$f":"H12-H46","v":{"v":151.40285196300002,"d":"$151.40"}}]
[]
["Fixed Costs"]
["Implements",{"v":1,"d":"1.00"},"acre",{"v":20.05,"d":"$20.05"},{"v":0,"d":"0%"},{"$f":"D50*B50","v":{"v":20.05,"d":"$20.05"}},{"$f":"F50*(1-E50)","v":{"v":20.05,"d":"$20.05"}},{"$f":"F50*E50","v":{"v":0,"d":"$0.00"}}]
["Tractors",{"v":1,"d":"1.00"},"acre",{"v":5.07,"d":"$5.07"},{"v":0,"d":"0%"},{"v":5.07,"d":"$5.07"},{"v":5.07,"d":"$5.07"},{"v":0,"d":"$0.00"}]
["Irrigation Equipment",{"v":1,"d":"1.00"},"acre",{"v":36.27,"d":"$36.27"},{"v":0,"d":"0%"},{"v":36.27,"d":"$36.27"},{"v":36.27,"d":"$36.27"},{"v":0,"d":"$0.00"}]
["Self Propelled Equipment",{"v":1,"d":"1.00"},"acre",{"v":0,"d":"$0.00"},{"v":1,"d":"100%"},{"v":0,"d":"$0.00"},{"v":0,"d":"$0.00"},{"v":0,"d":"$0.00"}]
["Pickup",{"v":1,"d":"1.00"},"acre",{"v":5.49,"d":"$5.49"},{"v":0,"d":"0%"},{"v":5.49,"d":"$5.49"},{"v":5.49,"d":"$5.49"},{"v":0,"d":"$0.00"}]
["Management",{"v":1,"d":"1.00"},"acre",{"v":0,"d":"$0.00"},{"v":0,"d":"0%"},{"v":0,"d":"$0.00"},{"v":0,"d":"$0.00"},{"v":0,"d":"$0.00"}]
["Irrigation Investment",{"v":1,"d":"1.00"},"acre",{"v":27.72,"d":"$27.72"},{"v":0,"d":"0%"},{"$f":"B56*D56","v":{"v":27.72,"d":"$27.72"}},{"v":27.72,"d":"$27.72"},{"v":0,"d":"$0.00"}]
["Land",{"v":1,"d":"1.00"},"acre",{"v":72,"d":"$72.00"},{"v":1,"d":"100%"},{"$f":"D57*B57","v":{"v":72,"d":"$72.00"}},{"$f":"IF($H$6=\"Cash\",D57,F57*(1-E57))","v":{"v":0,"d":"$0.00"}},{"$f":"IF($H$6=\"Cash\",0,F57*E57)","v":{"v":72,"d":"$72.00"}}]
["Property Tax",{"v":1,"d":"1.00"},"acre",{"v":0,"d":"$0.00"},{"v":1,"d":"100%"},{"$f":"B58*D58","v":{"v":0,"d":"$0.00"}},{"v":0,"d":"$0.00"},{"v":0,"d":"$0.00"}]
["Total Fixed Expenses",{"$nulls":4},{"$f":"SUM(F50:F58)","v":{"v":166.6,"d":"$166.60"}},{"$f":"SUM(G50:G58)","v":{"v":94.6,"d":"$94.60"}},{"$f":"SUM(H50:H58)","v":{"v":72,"d":"$72.00"}}]
["Total Specified Expenses",{"$nulls":4},{"$f":"F46+F59","v":{"v":674.1020416137645,"d":"$674.10"}},{"$f":"G46+G59","v":{"v":535.9186140533043,"d":"$535.92"}},{"$f":"H46+H59","v":{"v":139.585148037,"d":"$139.59"}}]
["Returns Above Total Specified Expenses",{"$nulls":4},{"$f":"F12-F60","v":{"v":-10.502041613764504,"d":"($10.50)"}},{"$f":"G12-G60","v":{"v":-91.30661405330432,"d":"($91.31)"}},{"$f":"H12-H60","v":{"v":79.40285196300002,"d":"$79.40"}}]
[]
["Return on Investment",{"$nulls":4},{"$f":"(F61/F60)","v":{"v":-0.01557930545444303,"d":"-1.56%"}},{"$f":"(G61/G60)","v":{"v":-0.17037403004670154,"d":"-17.04%"}},{"v":0.5688488573437097,"d":"56.88%"}]

{"sheet":"Irr Sorghum Sudangrass","index":12,"n_rows":63,"n_cols":9,"rows_kept":63,"merged":[[1,0,1,7],[2,0,2,7],[3,0,3,7]]}
[]
[" Estimated Costs and Returns per Acre"]
["Irrigated Sorghum Sudangrass"]
["Projected for 2016"]
[{"$nulls":7},"Rental Agreement","Share"]
["Item ","Quantity","Unit","Price","Landlord"," ",null,"Share","Cash"]
[{"$nulls":4},"Share","Total","Tenant","Landlord"]
["Income"]
["grazing",{"v":800,"d":"800.00"},"lb",{"$f":"Grazing_Price","v":{"v":0.4,"d":"$0.400"}},{"v":0.33,"d":"33%"},{"$f":"D9*B9","v":{"v":320,"d":"$320.00"}},{"$f":"F9*(1-E9)","v":{"v":214.39999999999998,"d":"$214.40"}},{"$f":"IF(H6=\"Cash\", 0,F9*E9)","v":{"v":105.60000000000001,"d":"$105.60"}}]
["other income",{"v":0,"d":"0.00"},"$/ac.",{"v":1,"d":"$1.00"},{"v":0.33,"d":"33%"},{"$f":"D10*B10","v":{"v":0,"d":"$0.00"}},{"$f":"F10*(1-E10)","v":{"v":0,"d":"$0.00"}},{"$f":"IF(H7=\"Cash\", D59,F10*E10)","v":{"v":0,"d":"$0.00"}}]
[]
["Total Income",{"$nulls":4},{"$f":"SUM(F9:F11)","v":{"v":320,"d":"$320.00"}},{"$f":"SUM(G9:G11)","v":{"v":214.39999999999998,"d":"$214.40"}},{"$f":"SUM(H9:H11)","v":{"v":105.60000000000001,"d":"$105.60"}}]
[]
["Variable Costs"]
["Seed",{"v":22,"d":"22.00"},"bu",{"v":0.95,"d":"$0.95"},{"v":0,"d":"0%"},{"$f":"D15*B15","v":{"v":20.9,"d":"$20.90"}},{"$f":"F15*(1-E15)","v":{"v":20.9,"d":"$20.90"}},{"$f":"F15*E15","v":{"v":0,"d":"$0.00"}}]
["Fertilizer"]
["fert (N) - NH3 ",{"v":160,"d":"160.0"},"lb",{"$f":"IF(A17=\"\",0,VLOOKUP(A17,'Universal Input Prices'!$A$26:$B$30, 2))","v":{"v":0.25000000000000006,"d":"$0.250"}},{"v":0.33,"d":"33%"},{"$f":"D17*B17","v":{"v":40.00000000000001,"d":"$40.00"}},{"$f":"F17*(1-E17)","v":{"v":26.8,"d":"$26.80"}},{"$f":"F17*E17","v":{"v":13.200000000000003,"d":"$13.20"}}]
["fert (P) - liquid",{"v":50,"d":"50.0"},"lb",{"$f":"IF(A18=\"\",0,VLOOKUP(A18,'Universal Input Prices'!$A$26:$B$30, 2))","v":{"v":0.47,"d":"$0.470"}},{"v":0.33,"d":"33%"},{"$f":"D18*B18","v":{"v":23.5,"d":"$23.50"}},{"$f":"F18*(1-E18)","v":{"v":15.744999999999997,"d":"$15.75"}},{"$f":"F18*E18","v":{"v":7.755000000000001,"d":"$7.76"}}]
[null,{"v":0,"d":"0.0"},"lb",{"$f":"IF(A19=\"\",0,VLOOKUP(A19,'Universal Input Prices'!$A$26:$B$30, 2))","v":{"v":0,"d":"$0.000"}},{"v":0,"d":"0%"},{"$f":"D19*B19","v":{"v":0,"d":"$0.00"}},{"$f":"F19*(1-E19)","v":{"v":0,"d":"$0.00"}},{"$f":"F19*E19","v":{"v":0,"d":"$0.00"}}]
["Field Operations"]
["herbicide & application",{"v":1,"d":"1.0"},"acre",{"v":12.1,"d":"$12.10"},{"v":0.33,"d":"33%"},{"$f":"D21*B21","v":{"v":12.1,"d":"$12.10"}},{"$f":"F21*(1-E21)","v":{"v":8.107,"d":"$8.11"}},{"$f":"F21*E21","v":{"v":3.993,"d":"$3.99"}}]
["fertilizer application",{"v":1,"d":"1.0"},"acre",{"v":15,"d":"$15.00"},{"v":0.33,"d":"33%"},{"v":15,"d":"$15.00"},{"v":10.049999999999999,"d":"$10.05"},{"v":4.95,"d":"$4.95"}]
["insecticide & application",{"v":1,"d":"1.0"},"acre",{"v":0,"d":"$0.00"},{"v":0.33,"d":"33%"},{"v":0,"d":"$0.00"},{"v":0,"d":"$0.00"},{"v":0,"d":"$0.00"}]
["custom harvest & haul",{"v":0,"d":"0.0"},"bu.",{"v":0,"d":"$0.00"},{"v":0.33,"d":"33%"},{"v":0,"d":"$0.00"},{"v":0,"d":"$0.00"},{"v":0,"d":"$0.00"}]
["hoeing",{"v":0,"d":"0.0"},"acre",{"v":0,"d":"$0.00"},{"v":0,"d":"0%"},{"v":0,"d":"$0.00"},{"v":0,"d":"$0.00"},{"v":0,"d":"$0.00"}]
["scouting",{"v":1,"d":"1.0"},"acre",{"v":0,"d":"$0.00"},{"v":0,"d":"0%"},{"$f":"D26*B26","v":{"v":0,"d":"$0.00"}},{"$f":"F26*(1-E26)","v":{"v":0,"d":"$0.00"}},{"$f":"F26*E26","v":{"v":0,"d":"$0.00"}}]
["other ",{"v":1,"d":"1.0"},"acre",{"v":0,"d":"$0.00"},{"v":0,"d":"0%"},{"v":0,"d":"$0.00"},{"v":0,"d":"$0.00"},{"v":0,"d":"$0.00"}]
["other ",{"v":1,"d":"1.0"},"acre",{"v":0,"d":"$0.00"},{"v":0,"d":"0%"},{"v":0,"d":"$0.00"},{"v":0,"d":"$0.00"},{"v":0,"d":"$0.00"}]
["other ",{"v":1,"d":"1.0"},"acre",{"v":0,"d":"$0.00"},{"v":0,"d":"0%"},{"v":0,"d":"$0.00"},{"v":0,"d":"$0.00"},{"v":0,"d":"$0.00"}]
["Crop Insurance",{"v":1,"d":"1.0"},"acre",{"v":25,"d":"$25.00"},{"v":0.33,"d":"33%"},{"v":25,"d":"$25.00"},{"v":16.75,"d":"$16.75"},{"v":8.25,"d":"$8.25"}]
["Operator Labor & Hand Labor",{"v":0.855,"d":"0.86"},"hours",{"$f":"'Universal Input Prices'!$B$31","v":{"v":12.45,"d":"$12.45"}},{"v":0,"d":"0%"},{"v":10.644749999999998,"d":"$10.64"},{"v":10.644749999999998,"d":"$10.64"},{"v":0,"d":"$0.00"}]
["Irrigation Labor",{"v":0.576,"d":"0.58"},"hours",{"$f":"'Universal Input Prices'!$B$31","v":{"v":12.45,"d":"$12.45"}},{"v":0,"d":"0%"},{"v":7.171199999999999,"d":"$7.17"},{"v":7.171199999999999,"d":"$7.17"},{"v":0,"d":"$0.00"}]
["Diesel Fuel - Tractors",2.12,"gallons",{"$f":"'Universal Input Prices'!$B$32","v":{"v":1.81,"d":"$1.81"}},{"v":0,"d":"0%"},{"v":3.8372,"d":"$3.84"},{"v":3.8372,"d":"$3.84"},{"v":0,"d":"$0.00"}]
["Gasoline - Pickup",{"v":2.04923,"d":"2.05"},"gallons",{"$f":"'Universal Input Prices'!$B$33","v":{"v":1.926,"d":"$1.93"}},{"v":0,"d":"0%"},{"v":3.94681698,"d":"$3.95"},{"v":3.94681698,"d":"$3.95"},{"v":0,"d":"$0.00"}]
["Irrigation Fuel",{"v":9,"d":"9.00"},"acin",{"$f":"'Universal Input Prices'!$B$34","v":{"v":3.6,"d":"$3.60"}},{"v":0.33,"d":"33%"},{"v":32.4,"d":"$32.40"},{"v":21.708,"d":"$21.71"},{"v":10.692,"d":"$10.69"}]
["Pumping Days",48.49]
["Calculated GPM capacity per acre needed",{"$f":"B35*18.85694/B36","v":{"v":3.4999476180655806,"d":"3.50"}}]
["Repair & Maintenance"]
["Implements",{"v":1,"d":"1.00"},"acre",{"v":11.98,"d":"$11.98"},{"v":0,"d":"0%"},{"$f":"D39*B39","v":{"v":11.98,"d":"$11.98"}},{"v":11.98,"d":"$11.98"},{"v":0,"d":"$0.00"}]
["Tractors",{"v":1,"d":"1.00"},"acre",{"v":3.78,"d":"$3.78"},{"v":0,"d":"0%"},{"$f":"D40*B40","v":{"v":3.78,"d":"$3.78"}},{"v":3.78,"d":"$3.78"},{"v":0,"d":"$0.00"}]
["Irrigation-Above Ground",{"$f":"B35","v":{"v":9,"d":"9.00"}},"acin",{"v":4.04,"d":"$4.04"},{"v":0,"d":"0%"},{"$f":"D41*B41","v":{"v":36.36,"d":"$36.36"}},{"v":36.36,"d":"$36.36"},{"v":0,"d":"$0.00"}]
["Self Propelled Equipment",{"v":1,"d":"1.00"},"acre",{"v":0,"d":"$0.00"},{"v":1,"d":"100%"},{"$f":"D42*B42","v":{"v":0,"d":"$0.00"}},{"v":0,"d":"$0.00"},{"v":0,"d":"$0.00"}]
["Pickup",{"v":1,"d":"1.00"},"acre",{"v":2.51,"d":"$2.51"},{"v":0,"d":"0%"},{"$f":"D43*B43","v":{"v":2.51,"d":"$2.51"}},{"v":2.51,"d":"$2.51"},{"v":0,"d":"$0.00"}]
["Interest-operating capital",{"$f":"'Universal Input Prices'!$B$35","v":{"v":0.054,"d":"5.40%"}},{"$nulls":3},{"$f":"(SUM(F15:F23,F25:F43))*$B44/2.665","v":{"v":5.048036854378986,"d":"$5.05"}},{"$f":"(SUM(G15:G23,G25:G43))*$B44/2","v":{"v":5.40782910846,"d":"$5.41"}},{"v":1.31868,"d":"$1.32"}]
[]
["Total Variable Costs",{"$nulls":4},{"$f":"SUM(F15:F44)","v":{"v":254.17800383437893,"d":"$254.18"}},{"$f":"SUM(G15:G44)","v":{"v":205.69779608845997,"d":"$205.70"}},{"$f":"SUM(H15:H44)","v":{"v":50.158680000000004,"d":"$50.16"}}]
["Returns Above Variable Costs",{"$nulls":4},{"$f":"F12-F46","v":{"v":65.82199616562107,"d":"$65.82"}},{"$f":"G12-G46","v":{"v":8.70220391154001,"d":"$8.70"}},{"$f":"H12-H46","v":{"v":55.441320000000005,"d":"$55.44"}}]
[]
["Fixed Costs"]
["Implements",{"v":1,"d":"1.00"},"acre",{"v":18.79,"d":"$18.79"},{"v":0,"d":"0%"},{"$f":"D50*B50","v":{"v":18.79,"d":"$18.79"}},{"$f":"F50*(1-E50)","v":{"v":18.79,"d":"$18.79"}},{"$f":"F50*E50","v":{"v":0,"d":"$0.00"}}]
["Tractors",{"v":1,"d":"1.00"},"acre",{"v":5.4,"d":"$5.40"},{"v":0,"d":"0%"},{"v":5.4,"d":"$5.40"},{"v":5.4,"d":"$5.40"},{"v":0,"d":"$0.00"}]
["Irrigation Equipment",{"v":1,"d":"1.00"},"acre",{"v":30.74,"d":"$30.74"},{"v":0,"d":"0%"},{"v":30.74,"d":"$30.74"},{"v":30.74,"d":"$30.74"},{"v":0,"d":"$0.00"}]
["Self Propelled Equipment",{"v":1,"d":"1.00"},"acre",{"v":0,"d":"$0.00"},{"v":1,"d":"100%"},{"v":0,"d":"$0.00"},{"v":0,"d":"$0.00"},{"v":0,"d":"$0.00"}]
["Pickup",{"v":1,"d":"1.00"},"acre",{"v":3.66,"d":"$3.66"},{"v":0,"d":"0%"},{"v":3.66,"d":"$3.66"},{"v":3.66,"d":"$3.66"},{"v":0,"d":"$0.00"}]
["Management",{"v":1,"d":"1.00"},"acre",{"v":0,"d":"$0.00"},{"v":0,"d":"0%"},{"v":0,"d":"$0.00"},{"v":0,"d":"$0.00"},{"v":0,"d":"$0.00"}]
["Irrigation Investment",{"v":1,"d":"1.00"},"acre",{"v":25.43,"d":"$25.43"},{"v":0,"d":"0%"},{"$f":"B56*D56","v":{"v":25.43,"d":"$25.43"}},{"v":25.43,"d":"$25.43"},{"v":0,"d":"$0.00"}]
["Land",{"v":1,"d":"1.00"},"acre",{"v":72,"d":"$72.00"},{"v":1,"d":"100%"},{"$f":"D57*B57","v":{"v":72,"d":"$72.00"}},{"$f":"IF($H$6=\"Cash\",D57,F57*(1-E57))","v":{"v":0,"d":"$0.00"}},{"$f":"IF($H$6=\"Cash\",0,F57*E57)","v":{"v":72,"d":"$72.00"}}]
["Property Tax",{"v":1,"d":"1.00"},"acre",{"v":0,"d":"$0.00"},{"v":1,"d":"100%"},{"$f":"B58*D58","v":{"v":0,"d":"$0.00"}},{"v":0,"d":"$0.00"},{"v":0,"d":"$0.00"}]
["Total Fixed Expenses",{"$nulls":4},{"$f":"SUM(F50:F58)","v":{"v":156.01999999999998,"d":"$156.02"}},{"$f":"SUM(G50:G58)","v":{"v":84.01999999999998,"d":"$84.02"}},{"$f":"SUM(H50:H58)","v":{"v":72,"d":"$72.00"}}]
["Total Specified Expenses",{"$nulls":4},{"$f":"F46+F59","v":{"v":410.19800383437894,"d":"$410.20"}},{"$f":"G46+G59","v":{"v":289.71779608846,"d":"$289.72"}},{"$f":"H46+H59","v":{"v":122.15868,"d":"$122.16"}}]
["Returns Above Total Specified Expenses",{"$nulls":4},{"$f":"F12-F60","v":{"v":-90.19800383437894,"d":"($90.20)"}},{"$f":"G12-G60","v":{"v":-75.31779608846,"d":"($75.32)"}},{"$f":"H12-H60","v":{"v":-16.558679999999995,"d":"($16.56)"}}]
[]
["Return on Investment",{"$nulls":4},{"$f":"(F61/F60)","v":{"v":-0.21988893897883807,"d":"-21.99%"}},{"$f":"(G61/G60)","v":{"v":-0.2599695189779198,"d":"-26.00%"}},{"v":-0.13555058060548783,"d":"-13.56%"}]

{"sheet":"Irr Soybeans","index":13,"n_rows":66,"n_cols":9,"rows_kept":66,"merged":[[1,0,1,7],[2,0,2,7],[3,0,3,7]]}
[]
[" Estimated Costs and Returns per Acre"]
["Irrigated Soybeans"]
["Projected for 2016"]
[{"$nulls":7},"Rental Agreement","Share"]
["Item ","Quantity","Unit","Price","Landlord"," ",null,"Share","Cash"]
[{"$nulls":4},"Share","Total","Tenant","Landlord"]
["Income"]
["soybeans",{"v":60,"d":"60.0"},"bu",{"$f":"'Universal Input Prices'!$B$14","v":{"v":8.4,"d":"$8.40"}},{"v":0.33,"d":"33%"},{"$f":"D9*B9","v":{"v":504,"d":"$504.00"}},{"$f":"F9*(1-E9)","v":{"v":337.67999999999995,"d":"$337.68"}},{"$f":"IF(H6=\"Cash\", D60,F9*E9)","v":{"v":166.32000000000002,"d":"$166.32"}}]
["other income",{"v":0,"d":"0.00"},"$/ac.",{"v":1,"d":"$1.00"},{"v":0.33,"d":"33%"},{"$f":"D10*B10","v":{"v":0,"d":"$0.00"}},{"$f":"F10*(1-E10)","v":{"v":0,"d":"$0.00"}},{"$f":"IF(H7=\"Cash\", D59,F10*E10)","v":{"v":0,"d":"$0.00"}}]
[]
["Total Income",{"$nulls":4},{"$f":"SUM(F8:F11)","v":{"v":504,"d":"$504.00"}},{"$f":"SUM(G8:G11)","v":{"v":337.67999999999995,"d":"$337.68"}},{"$f":"SUM(H8:H11)","v":{"v":166.32000000000002,"d":"$166.32"}}]
[]
["Variable Costs"]
["Seed"]
["soybean seed",{"v":1,"d":"1.00"},"bag",{"v":73,"d":"$73.000"},{"v":0,"d":"0%"},{"$f":"D16*B16","v":{"v":73,"d":"$73.00"}},{"$f":"F16*(1-E16)","v":{"v":73,"d":"$73.00"}},{"$f":"F16*E16","v":{"v":0,"d":"$0.00"}}]
["tech fee",{"$f":"B16","v":{"v":1,"d":"1.00"}},"lb",{"v":0,"d":"$0.000"},{"v":0,"d":"0%"},{"$f":"D17*B17","v":{"v":0,"d":"$0.00"}},{"$f":"F17*(1-E17)","v":{"v":0,"d":"$0.00"}},{"$f":"+F17*E17","v":{"v":0,"d":"$0.00"}}]
["innoculant",{"v":1,"d":"1.0"},"acre",{"v":7.85,"d":"$7.85"},{"v":0,"d":"0%"},{"$f":"D18*B18","v":{"v":7.85,"d":"$7.85"}},{"$f":"F18*(1-E18)","v":{"v":7.85,"d":"$7.85"}},{"$f":"F18*E18","v":{"v":0,"d":"$0.00"}}]
["Fertilizer"]
["fert (P) - liquid",{"v":45,"d":"45.0"},"lb",{"$f":"IF(A20=\"\",0,VLOOKUP(A20,'Universal Input Prices'!$A$26:$B$30, 2))","v":{"v":0.47,"d":"$0.470"}},{"v":0.33,"d":"33%"},{"$f":"D20*B20","v":{"v":21.15,"d":"$21.15"}},{"$f":"F20*(1-E20)","v":{"v":14.170499999999997,"d":"$14.17"}},{"$f":"F20*E20","v":{"v":6.9795,"d":"$6.98"}}]
[null,{"v":0,"d":"0.0"},"lb",{"$f":"IF(A21=\"\",0,VLOOKUP(A21,'Universal Input Prices'!$A$26:$B$30, 2))","v":{"v":0,"d":"$0.000"}},{"v":0,"d":"0%"},{"$f":"D21*B21","v":{"v":0,"d":"$0.00"}},{"$f":"F21*(1-E21)","v":{"v":0,"d":"$0.00"}},{"$f":"F21*E21","v":{"v":0,"d":"$0.00"}}]
[null,{"v":0,"d":"0.0"},"lb",{"$f":"IF(A22=\"\",0,VLOOKUP(A22,'Universal Input Prices'!$A$26:$B$30, 2))","v":{"v":0,"d":"$0.000"}},{"v":0,"d":"0%"},{"$f":"D22*B22","v":{"v":0,"d":"$0.00"}},{"$f":"F22*(1-E22)","v":{"v":0,"d":"$0.00"}},{"$f":"F22*E22","v":{"v":0,"d":"$0.00"}}]
["Field Operations"]
["herbicide & application",{"v":2,"d":"2.0"},"acre",{"v":12.05,"d":"$12.05"},{"v":0.33,"d":"33%"},{"$f":"D24*B24","v":{"v":24.1,"d":"$24.10"}},{"$f":"F24*(1-E24)","v":{"v":16.147,"d":"$16.15"}},{"$f":"F24*E24","v":{"v":7.953000000000001,"d":"$7.95"}}]
["fertilizer application",{"v":1,"d":"1.0"},"acre",{"v":0,"d":"$0.00"},{"v":0.33,"d":"33%"},{"v":0,"d":"$0.00"},{"v":0,"d":"$0.00"},{"v":0,"d":"$0.00"}]
["insecticide & application",0.5,"acre",{"v":9,"d":"$9.00"},{"v":0.33,"d":"33%"},{"v":4.5,"d":"$4.50"},{"v":3.0149999999999997,"d":"$3.02"},{"v":1.485,"d":"$1.49"}]
["custom harvest & haul",{"$f":"$B$9","v":{"v":60,"d":"60.0"}},"bu.",{"v":0.66,"d":"$0.66"},{"v":0,"d":"0%"},{"v":39.6,"d":"$39.60"},{"v":39.6,"d":"$39.60"},{"v":0,"d":"$0.00"}]
["crop consultant",{"v":1,"d":"1.0"},"acre",{"v":0,"d":"$0.00"},{"v":0,"d":"0%"},{"v":0,"d":"$0.00"},{"v":0,"d":"$0.00"},{"v":0,"d":"$0.00"}]
["scouting",{"v":1,"d":"1.0"},"acre",{"v":0,"d":"$0.00"},{"v":0,"d":"0%"},{"$f":"D29*B29","v":{"v":0,"d":"$0.00"}},{"$f":"F29*(1-E29)","v":{"v":0,"d":"$0.00"}},{"$f":"F29*E29","v":{"v":0,"d":"$0.00"}}]
["other ",{"v":1,"d":"1.0"},"acre",{"v":0,"d":"$0.00"},{"v":0,"d":"0%"},{"v":0,"d":"$0.00"},{"v":0,"d":"$0.00"},{"v":0,"d":"$0.00"}]
["other ",{"v":1,"d":"1.0"},"acre",{"v":0,"d":"$0.00"},{"v":0,"d":"0%"},{"v":0,"d":"$0.00"},{"v":0,"d":"$0.00"},{"v":0,"d":"$0.00"}]
["other ",{"v":1,"d":"1.0"},"acre",{"v":0,"d":"$0.00"},{"v":0,"d":"0%"},{"v":0,"d":"$0.00"},{"v":0,"d":"$0.00"},{"v":0,"d":"$0.00"}]
["Crop Insurance",{"v":1,"d":"1.0"},"acre",{"v":37,"d":"$37.00"},{"v":0.33,"d":"33%"},{"v":37,"d":"$37.00"},{"v":24.79,"d":"$24.79"},{"v":12.21,"d":"$12.21"}]
["Operator Labor & Hand Labor",{"v":0.715,"d":"0.72"},"hour",{"$f":"'Universal Input Prices'!$B$31","v":{"v":12.45,"d":"$12.45"}},{"v":0,"d":"0%"},{"v":8.90175,"d":"$8.90"},{"v":8.90175,"d":"$8.90"},{"v":0,"d":"$0.00"}]
["Irrigation Labor",{"v":0.896,"d":"0.90"},"hours",{"$f":"'Universal Input Prices'!$B$31","v":{"v":12.45,"d":"$12.45"}},{"v":0,"d":"0%"},{"v":11.155199999999999,"d":"$11.16"},{"v":11.155199999999999,"d":"$11.16"},{"v":0,"d":"$0.00"}]
["Diesel Fuel - Tractors",{"v":2,"d":"2.00"},"gallons",{"$f":"'Universal Input Prices'!$B$32","v":{"v":1.81,"d":"$1.81"}},{"v":0,"d":"0%"},{"v":3.62,"d":"$3.62"},{"v":3.62,"d":"$3.62"},{"v":0,"d":"$0.00"}]
["Gasoline - Pickup",{"v":2.049,"d":"2.05"},"gallons",{"$f":"'Universal Input Prices'!$B$33","v":{"v":1.926,"d":"$1.93"}},{"v":0,"d":"0%"},{"v":3.9463739999999996,"d":"$3.95"},{"v":3.9463739999999996,"d":"$3.95"},{"v":0,"d":"$0.00"}]
["Irrigation Fuel",{"v":14,"d":"14.00"},"acin",{"$f":"'Universal Input Prices'!$B$34","v":{"v":3.6,"d":"$3.60"}},{"v":0.33,"d":"33%"},{"v":50.4,"d":"$50.40"},{"v":33.767999999999994,"d":"$33.77"},{"v":16.632,"d":"$16.63"}]
["Pumping Days",67.88]
["Calculated GPM capacity per acre needed",{"$f":"B38*18.85694/B39","v":{"v":3.8891744254566887,"d":"3.89"}}]
["Repair & Maintenance",{"$nulls":5},{"v":0,"d":"$0.00"},{"v":0,"d":"$0.00"}]
["Implements",{"v":1,"d":"1.00"},"acre",{"v":12.7,"d":"$12.70"},{"v":0,"d":"0%"},{"$f":"D42*B42","v":{"v":12.7,"d":"$12.70"}},{"v":12.7,"d":"$12.70"},{"v":0,"d":"$0.00"}]
["Tractors",{"v":1,"d":"1.00"},"acre",{"v":3.86,"d":"$3.86"},{"v":0,"d":"0%"},{"$f":"D43*B43","v":{"v":3.86,"d":"$3.86"}},{"v":3.86,"d":"$3.86"},{"v":0,"d":"$0.00"}]
["Irrigation-Above Ground",{"$f":"B38","v":{"v":14,"d":"14.00"}},"acin",{"v":4.04,"d":"$4.04"},{"v":0,"d":"0%"},{"$f":"D44*B44","v":{"v":56.56,"d":"$56.56"}},{"v":56.56,"d":"$56.56"},{"v":0,"d":"$0.00"}]
["Self Propelled Equipment",{"v":1,"d":"1.00"},"acre",{"v":0,"d":"$0.00"},{"v":1,"d":"100%"},{"$f":"D45*B45","v":{"v":0,"d":"$0.00"}},{"v":0,"d":"$0.00"},{"v":0,"d":"$0.00"}]
["Pickup",{"v":1,"d":"1.00"},"acre",{"v":2.51,"d":"$2.51"},{"v":0,"d":"0%"},{"$f":"D46*B46","v":{"v":2.51,"d":"$2.51"}},{"v":2.51,"d":"$2.51"},{"v":0,"d":"$0.00"}]
["Interest-operating capital",{"$f":"'Universal Input Prices'!$B$35","v":{"v":0.054,"d":"5.40%"}},{"$nulls":3},{"$f":"(SUM(F16:F26,F28:F46))*$B47/2.7","v":{"v":6.42506648,"d":"$6.43"}},{"$f":"(SUM(G16:G26,G28:G46))*$B47/2","v":{"v":7.451833248000001,"d":"$7.45"}},{"v":1.2220065,"d":"$1.22"}]
[]
["Total Variable Costs",{"$nulls":4},{"$f":"SUM(F16:F47)","v":{"v":367.27839048,"d":"$367.28"}},{"$f":"SUM(G16:G47)","v":{"v":323.045657248,"d":"$323.05"}},{"$f":"SUM(H16:H47)","v":{"v":46.4815065,"d":"$46.48"}}]
["Returns Above Variable Costs",{"$nulls":4},{"$f":"F12-F49","v":{"v":136.72160952000002,"d":"$136.72"}},{"$f":"G12-G49","v":{"v":14.634342751999952,"d":"$14.63"}},{"$f":"H12-H49","v":{"v":119.83849350000003,"d":"$119.84"}}]
[]
["Fixed Costs"]
["Implements",{"v":1,"d":"1.00"},"acre",{"v":20.09,"d":"$20.09"},{"v":0,"d":"0%"},{"$f":"D53*B53","v":{"v":20.09,"d":"$20.09"}},{"$f":"F53*(1-E53)","v":{"v":20.09,"d":"$20.09"}},{"$f":"F53*E53","v":{"v":0,"d":"$0.00"}}]
["Tractors",{"v":1,"d":"1.00"},"acre",{"v":5.41,"d":"$5.41"},{"v":0,"d":"0%"},{"v":5.41,"d":"$5.41"},{"v":5.41,"d":"$5.41"},{"v":0,"d":"$0.00"}]
["Irrigation Equipment",{"v":1,"d":"1.00"},"acre",{"v":40.42,"d":"$40.42"},{"v":0,"d":"0%"},{"v":40.42,"d":"$40.42"},{"v":40.42,"d":"$40.42"},{"v":0,"d":"$0.00"}]
["Self Propelled Equipment",{"v":1,"d":"1.00"},"acre",{"v":0,"d":"$0.00"},{"v":1,"d":"100%"},{"v":0,"d":"$0.00"},{"v":0,"d":"$0.00"},{"v":0,"d":"$0.00"}]
["Pickup",{"v":1,"d":"1.00"},"acre",{"v":3.66,"d":"$3.66"},{"v":0,"d":"0%"},{"v":3.66,"d":"$3.66"},{"v":3.66,"d":"$3.66"},{"v":0,"d":"$0.00"}]
["Management",{"v":1,"d":"1.00"},"acre",{"v":0,"d":"$0.00"},{"v":0,"d":"0%"},{"v":0,"d":"$0.00"},{"v":0,"d":"$0.00"},{"v":0,"d":"$0.00"}]
["Irrigation Investment",{"v":1,"d":"1.00"},"acre",{"v":29.44,"d":"$29.44"},{"v":0,"d":"0%"},{"v":29.44,"d":"$29.44"},{"v":29.44,"d":"$29.44"},{"v":0,"d":"$0.00"}]
["Land",{"v":1,"d":"1.00"},"acre",{"v":72,"d":"$72.00"},{"v":1,"d":"100%"},{"v":72,"d":"$72.00"},{"$f":"IF($H$6=\"Cash\",D60,F60*(1-E60))","v":{"v":0,"d":"$0.00"}},{"$f":"IF($H$6=\"Cash\",0,F60*E60)","v":{"v":72,"d":"$72.00"}}]
["Property Tax",{"v":1,"d":"1.00"},"acre",{"v":0,"d":"$0.00"},{"v":1,"d":"100%"},{"v":0,"d":"$0.00"},{"v":0,"d":"$0.00"},{"v":0,"d":"$0.00"}]
["Total Fixed Expenses",{"$nulls":4},{"$f":"SUM(F53:F61)","v":{"v":171.01999999999998,"d":"$171.02"}},{"$f":"SUM(G53:G61)","v":{"v":99.02,"d":"$99.02"}},{"$f":"SUM(H53:H61)","v":{"v":72,"d":"$72.00"}}]
["Total Specified Expenses",{"$nulls":4},{"$f":"F49+F62","v":{"v":538.29839048,"d":"$538.30"}},{"$f":"G49+G62","v":{"v":422.065657248,"d":"$422.07"}},{"$f":"H49+H62","v":{"v":118.4815065,"d":"$118.48"}}]
["Returns Above Total Specified Expenses",{"$nulls":4},{"$f":"F12-F63","v":{"v":-34.298390479999966,"d":"($34.30)"}},{"$f":"G12-G63","v":{"v":-84.38565724800003,"d":"($84.39)"}},{"$f":"H12-H63","v":{"v":47.83849350000003,"d":"$47.84"}}]
[]
["Return on Investment",{"$nulls":4},{"$f":"(F64/F63)","v":{"v":-0.06371631624128792,"d":"-6.37%"}},{"$f":"(G64/G63)","v":{"v":-0.19993490538467615,"d":"-19.99%"}},{"v":0.4037633797304901,"d":"40.38%"}]

{"sheet":"Irr Sunflowers-Confection","index":14,"n_rows":66,"n_cols":9,"rows_kept":66,"merged":[[1,0,1,7],[2,0,2,7],[3,0,3,7]]}
[]
[" Estimated Costs and Returns per Acre"]
["Irrigated Sunflowers-Confectionary "]
["Projected for 2016"]
[{"$nulls":7},"Rental Agreement","Share"]
["Item ","Quantity","Unit","Price","Landlord"," ",null,"Share","Cash"]
[{"$nulls":4},"Share","Total","Tenant","Landlord"]
["Income"]
["Confectionary sunflower",{"v":18,"d":"18.00"},"cwt",{"$f":"'Universal Input Prices'!$B$15","v":{"v":21,"d":"$21.00"}},{"v":0.33,"d":"33%"},{"$f":"D9*B9","v":{"v":378,"d":"$378.00"}},{"$f":"F9*(1-E9)","v":{"v":253.25999999999996,"d":"$253.26"}},{"$f":"IF(H6=\"Cash\", D60,F9*E9)","v":{"v":124.74000000000001,"d":"$124.74"}}]
["Expected % Large",{"v":0.667,"d":"66.7%"}]
["other income",{"v":0,"d":"0.00"},"$/ac.",{"v":1,"d":"$1.00"},{"v":0.33,"d":"33%"},{"$f":"D11*B11","v":{"v":0,"d":"$0.00"}},{"$f":"F11*(1-E11)","v":{"v":0,"d":"$0.00"}},{"$f":"IF(H8=\"Cash\", D60,F11*E11)","v":{"v":0,"d":"$0.00"}}]
[]
["Total Income",{"$nulls":4},{"$f":"SUM(F8:F12)","v":{"v":378,"d":"$378.00"}},{"$f":"SUM(G8:G12)","v":{"v":253.25999999999996,"d":"$253.26"}},{"$f":"SUM(H8:H12)","v":{"v":124.74000000000001,"d":"$124.74"}}]
[]
["Variable Costs"]
["Seed",{"v":1,"d":"1.00"},"acre",{"v":34,"d":"$34.00"},{"v":0,"d":"0%"},{"$f":"D16*B16","v":{"v":34,"d":"$34.00"}},{"$f":"F16*(1-E16)","v":{"v":34,"d":"$34.00"}},{"$f":"F16*E16","v":{"v":0,"d":"$0.00"}}]
["Fertilizer"]
["fert (P) - liquid",{"v":24,"d":"24.0"},"lb",{"$f":"IF(A18=\"\",0,VLOOKUP(A18,'Universal Input Prices'!$A$26:$B$30, 2))","v":{"v":0.47,"d":"$0.470"}},{"v":0.33,"d":"33%"},{"$f":"D18*B18","v":{"v":11.28,"d":"$11.28"}},{"$f":"F18*(1-E18)","v":{"v":7.557599999999999,"d":"$7.56"}},{"$f":"F18*E18","v":{"v":3.7224,"d":"$3.72"}}]
["fert (N) - liquid",{"v":70,"d":"70.0"},"lb",{"$f":"IF(A19=\"\",0,VLOOKUP(A19,'Universal Input Prices'!$A$26:$B$27, 2))","v":{"v":0.41015625,"d":"$0.410"}},{"v":0.33,"d":"33%"},{"$f":"D19*B19","v":{"v":28.7109375,"d":"$28.71"}},{"$f":"F19*(1-E19)","v":{"v":19.236328124999996,"d":"$19.24"}},{"$f":"F19*E19","v":{"v":9.474609375,"d":"$9.47"}}]
[null,{"v":0,"d":"0.0"},"lb",{"$f":"IF(A20=\"\",0,VLOOKUP(A20,'Universal Input Prices'!$A$26:$B$30, 2))","v":{"v":0,"d":"$0.000"}},{"v":0,"d":"0%"},{"$f":"D20*B20","v":{"v":0,"d":"$0.00"}},{"$f":"F20*(1-E20)","v":{"v":0,"d":"$0.00"}},{"$f":"F20*E20","v":{"v":0,"d":"$0.00"}}]
["Field Operations"]
["herbicide & application (2-4D/Prowl H2O)",{"v":1,"d":"1.0"},"acre",{"v":15.35,"d":"$15.35"},{"v":0.33,"d":"33%"},{"$f":"D22*B22","v":{"v":15.35,"d":"$15.35"}},{"$f":"F22*(1-E22)","v":{"v":10.2845,"d":"$10.28"}},{"$f":"F22*E22","v":{"v":5.0655,"d":"$5.07"}}]
["herbicide & application (glyphosphate)",{"v":3,"d":"3.0"},"acre",{"v":9.4,"d":"$9.40"},{"v":0.33,"d":"33%"},{"v":28.200000000000003,"d":"$28.20"},{"v":18.894,"d":"$18.89"},{"v":9.306000000000001,"d":"$9.31"}]
["seed insecticide & application",{"v":1,"d":"1.0"},"acre",{"v":9.8,"d":"$9.80"},{"v":0.33,"d":"33%"},{"v":9.8,"d":"$9.80"},{"v":6.566,"d":"$6.57"},{"v":3.2340000000000004,"d":"$3.23"}]
["custom harvest",{"v":1,"d":"1.0"},"acre",{"v":25,"d":"$25.00"},{"v":0,"d":"0%"},{"v":25,"d":"$25.00"},{"v":25,"d":"$25.00"},{"v":0,"d":"$0.00"}]
["custom haul",{"$f":"B9","v":{"v":18,"d":"18.00"}},"cwt",{"v":0.45,"d":"$0.45"},{"v":0,"d":"0%"},{"v":8.1,"d":"$8.10"},{"v":8.1,"d":"$8.10"},{"v":0,"d":"$0.00"}]
["pesticide & application (ammo)",{"v":1,"d":"1.0"},"acre",{"v":3.25,"d":"$3.25"},{"v":0.33,"d":"33%"},{"v":3.25,"d":"$3.25"},{"v":2.1774999999999998,"d":"$2.18"},{"v":1.0725,"d":"$1.07"}]
["other ",{"v":1,"d":"1.0"},"acre",{"v":0,"d":"$0.00"},{"v":0,"d":"0%"},{"v":0,"d":"$0.00"},{"v":0,"d":"$0.00"},{"v":0,"d":"$0.00"}]
["other ",{"v":1,"d":"1.0"},"acre",{"v":0,"d":"$0.00"},{"v":0,"d":"0%"},{"v":0,"d":"$0.00"},{"v":0,"d":"$0.00"},{"v":0,"d":"$0.00"}]
["other ",{"v":1,"d":"1.0"},"acre",{"v":0,"d":"$0.00"},{"v":0,"d":"0%"},{"v":0,"d":"$0.00"},{"v":0,"d":"$0.00"},{"v":0,"d":"$0.00"}]
["other ",{"v":1,"d":"1.0"},"acre",{"v":0,"d":"$0.00"},{"v":0,"d":"0%"},{"v":0,"d":"$0.00"},{"v":0,"d":"$0.00"},{"v":0,"d":"$0.00"}]
["other ",{"v":1,"d":"1.0"},"acre",{"v":0,"d":"$0.00"},{"v":0,"d":"0%"},{"v":0,"d":"$0.00"},{"v":0,"d":"$0.00"},{"v":0,"d":"$0.00"}]
["Crop Insurance",{"v":1,"d":"1.0"},"acre",{"v":21,"d":"$21.00"},{"v":0.33,"d":"33%"},{"v":21,"d":"$21.00"},{"v":14.069999999999999,"d":"$14.07"},{"v":6.930000000000001,"d":"$6.93"}]
["Operator Labor & Hand Labor",{"v":0.455,"d":"0.46"},"hours",{"$f":"'Universal Input Prices'!$B$31","v":{"v":12.45,"d":"$12.45"}},{"v":0,"d":"0%"},{"v":5.66475,"d":"$5.66"},{"v":5.66475,"d":"$5.66"},{"v":0,"d":"$0.00"}]
["Irrigation Labor",{"v":0.448,"d":"0.45"},"hours",{"$f":"'Universal Input Prices'!$B$31","v":{"v":12.45,"d":"$12.45"}},{"v":0,"d":"0%"},{"v":5.5775999999999994,"d":"$5.58"},{"v":5.5775999999999994,"d":"$5.58"},{"v":0,"d":"$0.00"}]
["Diesel Fuel - Tractors",1.57,"gallons",{"$f":"'Universal Input Prices'!$B$32","v":{"v":1.81,"d":"$1.81"}},{"v":0,"d":"0%"},{"v":2.8417000000000003,"d":"$2.84"},{"v":2.8417000000000003,"d":"$2.84"},{"v":0,"d":"$0.00"}]
["Gasoline - Pickup",4.51,"gallons",{"$f":"'Universal Input Prices'!$B$33","v":{"v":1.926,"d":"$1.93"}},{"v":0,"d":"0%"},{"v":8.686259999999999,"d":"$8.69"},{"v":8.686259999999999,"d":"$8.69"},{"v":0,"d":"$0.00"}]
["Irrigation Fuel",{"v":7,"d":"7.00"},"acin",{"$f":"'Universal Input Prices'!$B$34","v":{"v":3.6,"d":"$3.60"}},{"v":0.33,"d":"33%"},{"v":25.2,"d":"$25.20"},{"v":16.883999999999997,"d":"$16.88"},{"v":8.316,"d":"$8.32"}]
["Pumping Days",{"v":66,"d":"66.00"}]
["Calculated GPM capacity per acre needed",{"$f":"B38*18.85694/B39","v":{"v":1.999978484848485,"d":"2.00"}}]
["Repair & Maintenance"]
["Implements",{"v":1,"d":"1.00"},"acre",{"v":8.82,"d":"$8.82"},{"v":0,"d":"0%"},{"$f":"D42*B42","v":{"v":8.82,"d":"$8.82"}},{"$f":"F42*(1-E42)","v":{"v":8.82,"d":"$8.82"}},{"$f":"F42*E42","v":{"v":0,"d":"$0.00"}}]
["Tractors",{"v":1,"d":"1.00"},"acre",{"v":3.28,"d":"$3.28"},{"v":0,"d":"0%"},{"$f":"D43*B43","v":{"v":3.28,"d":"$3.28"}},{"$f":"F43*(1-E43)","v":{"v":3.28,"d":"$3.28"}},{"$f":"F43*E43","v":{"v":0,"d":"$0.00"}}]
["Irrigation-Above Ground",{"$f":"B38","v":{"v":7,"d":"7.00"}},"acin",{"v":4.04,"d":"$4.04"},{"v":0,"d":"0%"},{"$f":"D44*B44","v":{"v":28.28,"d":"$28.28"}},{"$f":"F44*(1-E44)","v":{"v":28.28,"d":"$28.28"}},{"$f":"F44*E44","v":{"v":0,"d":"$0.00"}}]
["Self Propelled Equipment",{"v":1,"d":"1.00"},"acre",{"v":0,"d":"$0.00"},{"v":1,"d":"100%"},{"$f":"D45*B45","v":{"v":0,"d":"$0.00"}},{"$f":"F45*(1-E45)","v":{"v":0,"d":"$0.00"}},{"$f":"F45*E45","v":{"v":0,"d":"$0.00"}}]
["Pickup",{"v":1,"d":"1.00"},"acre",{"v":5.52,"d":"$5.52"},{"v":0,"d":"0%"},{"$f":"D46*B46","v":{"v":5.52,"d":"$5.52"}},{"$f":"F46*(1-E46)","v":{"v":5.52,"d":"$5.52"}},{"$f":"F46*E46","v":{"v":0,"d":"$0.00"}}]
["Interest-operating capital",{"$f":"'Universal Input Prices'!$B$35","v":{"v":0.054,"d":"5.40%"}},{"$nulls":3},{"$f":"(SUM(F16:F24,F27:F46))*$B47/2.1","v":{"v":6.31186065,"d":"$6.31"}},{"$f":"(SUM(G16:G24,G27:G46))*$B47/2","v":{"v":5.355186429374999,"d":"$5.36"}},{"v":1.272267253125,"d":"$1.27"}]
[]
["Total Variable Costs",{"$nulls":4},{"$f":"SUM(F16:F47)","v":{"v":284.8731081499999,"d":"$284.87"}},{"$f":"SUM(G16:G47)","v":{"v":236.795424554375,"d":"$236.80"}},{"$f":"SUM(H16:H47)","v":{"v":48.39327662812501,"d":"$48.39"}}]
["Returns Above Variable Costs",{"$nulls":4},{"$f":"F13-F49","v":{"v":93.1268918500001,"d":"$93.13"}},{"$f":"G13-G49","v":{"v":16.464575445624973,"d":"$16.46"}},{"$f":"H13-H49","v":{"v":76.346723371875,"d":"$76.35"}}]
[]
["Fixed Costs"]
["Implements",{"v":1,"d":"1.00"},"acre",{"v":14.08,"d":"$14.08"},{"v":0,"d":"0%"},{"$f":"D53*B53","v":{"v":14.08,"d":"$14.08"}},{"$f":"F53*(1-E53)","v":{"v":14.08,"d":"$14.08"}},{"$f":"F53*E53","v":{"v":0,"d":"$0.00"}}]
["Tractors",{"v":1,"d":"1.00"},"acre",{"v":4.88,"d":"$4.88"},{"v":0,"d":"0%"},{"v":4.88,"d":"$4.88"},{"v":4.88,"d":"$4.88"},{"v":0,"d":"$0.00"}]
["Irrigation Equipment",{"v":1,"d":"1.00"},"acre",{"v":28.8,"d":"$28.80"},{"v":0,"d":"0%"},{"v":28.8,"d":"$28.80"},{"v":28.8,"d":"$28.80"},{"v":0,"d":"$0.00"}]
["Self Propelled Equipment",{"v":1,"d":"1.00"},"acre",{"v":0,"d":"$0.00"},{"v":1,"d":"100%"},{"v":0,"d":"$0.00"},{"v":0,"d":"$0.00"},{"v":0,"d":"$0.00"}]
["Pickup",{"v":1,"d":"1.00"},"acre",{"v":8.05,"d":"$8.05"},{"v":0,"d":"0%"},{"v":8.05,"d":"$8.05"},{"v":8.05,"d":"$8.05"},{"v":0,"d":"$0.00"}]
["Management",{"v":1,"d":"1.00"},"acre",{"v":0,"d":"$0.00"},{"v":0,"d":"0%"},{"v":0,"d":"$0.00"},{"v":0,"d":"$0.00"},{"v":0,"d":"$0.00"}]
["Irrigation Investment",{"v":1,"d":"1.00"},"acre",{"v":24.62,"d":"$24.62"},{"v":0,"d":"0%"},{"$f":"B59*D59","v":{"v":24.62,"d":"$24.62"}},{"v":24.62,"d":"$24.62"},{"v":0,"d":"$0.00"}]
["Land",{"v":1,"d":"1.00"},"acre",{"v":72,"d":"$72.00"},{"v":1,"d":"100%"},{"$f":"D60*B60","v":{"v":72,"d":"$72.00"}},{"$f":"IF($H$6=\"Cash\",D60,F60*(1-E60))","v":{"v":0,"d":"$0.00"}},{"$f":"IF($H$6=\"Cash\",0,F60*E60)","v":{"v":72,"d":"$72.00"}}]
["Property Tax",{"v":1,"d":"1.00"},"acre",{"v":0,"d":"$0.00"},{"v":1,"d":"100%"},{"$f":"B61*D61","v":{"v":0,"d":"$0.00"}},{"v":0,"d":"$0.00"},{"v":0,"d":"$0.00"}]
["Total Fixed Expenses",{"$nulls":4},{"$f":"SUM(F53:F61)","v":{"v":152.43,"d":"$152.43"}},{"$f":"SUM(G53:G61)","v":{"v":80.43,"d":"$80.43"}},{"$f":"SUM(H53:H61)","v":{"v":72,"d":"$72.00"}}]
["Total Specified Expenses",{"$nulls":4},{"$f":"F49+F62","v":{"v":437.3031081499999,"d":"$437.30"}},{"$f":"G49+G62","v":{"v":317.22542455437497,"d":"$317.23"}},{"$f":"H49+H62","v":{"v":120.39327662812501,"d":"$120.39"}}]
["Returns Above Total Specified Expenses",{"$nulls":4},{"$f":"F13-F63","v":{"v":-59.3031081499999,"d":"($59.30)"}},{"$f":"G13-G63","v":{"v":-63.965424554375005,"d":"($63.97)"}},{"$f":"H13-H63","v":{"v":4.346723371875001,"d":"$4.35"}}]
[]
["Return on Investment",{"$nulls":4},{"$f":"(F64/F63)","v":{"v":-0.13561099165491927,"d":"-13.56%"}},{"$f":"(G64/G63)","v":{"v":-0.2016402835435746,"d":"-20.16%"}},{"v":0.03610436972573903,"d":"3.61%"}]

{"sheet":"Irr Sunflowers-Oilseed","index":15,"n_rows":65,"n_cols":9,"rows_kept":65,"merged":[[1,0,1,7],[2,0,2,7],[3,0,3,7]]}
[]
[" Estimated Costs and Returns per Acre"]
["Irrigated Sunflowers-Oilseed "]
["Projected for 2016"]
[{"$nulls":7},"Rental Agreement","Share"]
["Item ","Quantity","Unit","Price","Landlord"," ",null,"Share","Cash"]
[{"$nulls":4},"Share","Total","Tenant","Landlord"]
["Income"]
["oilseed sunflower",{"v":20,"d":"20.00"},"cwt",{"$f":"'Universal Input Prices'!$B$16","v":{"v":16.5,"d":"$16.50"}},{"v":0.33,"d":"33%"},{"$f":"D9*B9","v":{"v":330,"d":"$330.00"}},{"$f":"F9*(1-E9)","v":{"v":221.09999999999997,"d":"$221.10"}},{"$f":"IF(H6=\"Cash\", D59,F9*E9)","v":{"v":108.9,"d":"$108.90"}}]
["other income",{"v":0,"d":"0.00"},"$/ac.",{"v":1,"d":"$1.00"},{"v":0.33,"d":"33%"},{"$f":"D10*B10","v":{"v":0,"d":"$0.00"}},{"$f":"F10*(1-E10)","v":{"v":0,"d":"$0.00"}},{"$f":"IF(H7=\"Cash\", D59,F10*E10)","v":{"v":0,"d":"$0.00"}}]
[]
["Total Income",{"$nulls":4},{"$f":"SUM(F8:F11)","v":{"v":330,"d":"$330.00"}},{"$f":"SUM(G8:G11)","v":{"v":221.09999999999997,"d":"$221.10"}},{"$f":"SUM(H8:H11)","v":{"v":108.9,"d":"$108.90"}}]
[]
["Variable Costs"]
["Seed",{"v":1,"d":"1.00"},"acre",{"v":32.35,"d":"$32.350"},{"v":0,"d":"0%"},{"$f":"D15*B15","v":{"v":32.35,"d":"$32.35"}},{"$f":"F15*(1-E15)","v":{"v":32.35,"d":"$32.35"}},{"$f":"F15*E15","v":{"v":0,"d":"$0.00"}}]
["Fertilizer"]
["fert (P) - liquid",{"v":24,"d":"24.0"},"lb",{"$f":"IF(A17=\"\",0,VLOOKUP(A17,'Universal Input Prices'!$A$26:$B$30, 2))","v":{"v":0.47,"d":"$0.470"}},{"v":0.33,"d":"33%"},{"$f":"D17*B17","v":{"v":11.28,"d":"$11.28"}},{"$f":"F17*(1-E17)","v":{"v":7.557599999999999,"d":"$7.56"}},{"$f":"F17*E17","v":{"v":3.7224,"d":"$3.72"}}]
["fert (N) - liquid",{"v":70,"d":"70.0"},"lb",{"$f":"IF(A18=\"\",0,VLOOKUP(A18,'Universal Input Prices'!$A$26:$B$27, 2))","v":{"v":0.41015625,"d":"$0.410"}},{"v":0.33,"d":"33%"},{"$f":"D18*B18","v":{"v":28.7109375,"d":"$28.71"}},{"$f":"F18*(1-E18)","v":{"v":19.236328124999996,"d":"$19.24"}},{"$f":"F18*E18","v":{"v":9.474609375,"d":"$9.47"}}]
[null,{"v":0,"d":"0.0"},"lb",{"$f":"IF(A19=\"\",0,VLOOKUP(A19,'Universal Input Prices'!$A$26:$B$30, 2))","v":{"v":0,"d":"$0.000"}},{"v":0,"d":"0%"},{"$f":"D19*B19","v":{"v":0,"d":"$0.00"}},{"$f":"F19*(1-E19)","v":{"v":0,"d":"$0.00"}},{"$f":"F19*E19","v":{"v":0,"d":"$0.00"}}]
["Field Operations"]
["herbicide & application (glyphosphate)",{"v":3,"d":"3.0"},"acre",{"v":9.4,"d":"$9.40"},{"v":0.33,"d":"33%"},{"$f":"D21*B21","v":{"v":28.200000000000003,"d":"$28.20"}},{"$f":"F21*(1-E21)","v":{"v":18.894,"d":"$18.89"}},{"$f":"F21*E21","v":{"v":9.306000000000001,"d":"$9.31"}}]
["herbicide & application (2-4D/Prowl H2O)",{"v":1,"d":"1.0"},null,{"v":15.35,"d":"$15.35"},{"v":0.33,"d":"33%"},{"v":15.35,"d":"$15.35"},{"v":10.2845,"d":"$10.28"},{"v":5.0655,"d":"$5.07"}]
["seed insecticide & application",{"v":1,"d":"1.0"},"acre",{"v":9.6,"d":"$9.60"},{"v":0.33,"d":"33%"},{"v":9.6,"d":"$9.60"},{"v":6.4319999999999995,"d":"$6.43"},{"v":3.168,"d":"$3.17"}]
["custom harvest",{"v":1,"d":"1.0"},"acre",{"v":25,"d":"$25.00"},{"v":0.33,"d":"33%"},{"v":25,"d":"$25.00"},{"v":16.75,"d":"$16.75"},{"v":8.25,"d":"$8.25"}]
["custom haul",{"$f":"B9","v":{"v":20,"d":"20.00"}},"cwt",{"v":0.45,"d":"$0.45"},{"v":0.33,"d":"33%"},{"v":9,"d":"$9.00"},{"v":6.029999999999999,"d":"$6.03"},{"v":2.97,"d":"$2.97"}]
["pesticide & application (ammo)",{"v":1,"d":"1.0"},"acre",{"v":3.25,"d":"$3.25"},{"v":0.33,"d":"33%"},{"$f":"D26*B26","v":{"v":3.25,"d":"$3.25"}},{"$f":"F26*(1-E26)","v":{"v":2.1774999999999998,"d":"$2.18"}},{"$f":"F26*E26","v":{"v":1.0725,"d":"$1.07"}}]
["other ",{"v":1,"d":"1.0"},"acre",{"v":0,"d":"$0.00"},{"v":0,"d":"0%"},{"$f":"D27*B27","v":{"v":0,"d":"$0.00"}},{"$f":"F27*(1-E27)","v":{"v":0,"d":"$0.00"}},{"$f":"F27*E27","v":{"v":0,"d":"$0.00"}}]
["other ",{"v":1,"d":"1.0"},"acre",{"v":0,"d":"$0.00"},{"v":0,"d":"0%"},{"$f":"D28*B28","v":{"v":0,"d":"$0.00"}},{"$f":"F28*(1-E28)","v":{"v":0,"d":"$0.00"}},{"$f":"F28*E28","v":{"v":0,"d":"$0.00"}}]
["other ",{"v":1,"d":"1.0"},"acre",{"v":0,"d":"$0.00"},{"v":0,"d":"0%"},{"v":0,"d":"$0.00"},{"v":0,"d":"$0.00"},{"v":0,"d":"$0.00"}]
["other ",{"v":1,"d":"1.0"},"acre",{"v":0,"d":"$0.00"},{"v":0,"d":"0%"},{"v":0,"d":"$0.00"},{"v":0,"d":"$0.00"},{"v":0,"d":"$0.00"}]
["other ",{"v":1,"d":"1.0"},"acre",{"v":0,"d":"$0.00"},{"v":0,"d":"0%"},{"v":0,"d":"$0.00"},{"v":0,"d":"$0.00"},{"v":0,"d":"$0.00"}]
["Crop Insurance",{"v":1,"d":"1.0"},"acre",{"v":21,"d":"$21.00"},{"v":0.33,"d":"33%"},{"v":21,"d":"$21.00"},{"v":14.069999999999999,"d":"$14.07"},{"v":6.930000000000001,"d":"$6.93"}]
["Operator Labor & Hand Labor",{"v":0.455,"d":"0.46"},"hours",{"$f":"'Universal Input Prices'!$B$31","v":{"v":12.45,"d":"$12.45"}},{"v":0,"d":"0%"},{"v":5.66475,"d":"$5.66"},{"v":5.66475,"d":"$5.66"},{"v":0,"d":"$0.00"}]
["Irrigation Labor",{"v":0.448,"d":"0.45"},"hours",{"$f":"'Universal Input Prices'!$B$31","v":{"v":12.45,"d":"$12.45"}},{"v":0,"d":"0%"},{"v":5.5775999999999994,"d":"$5.58"},{"v":5.5775999999999994,"d":"$5.58"},{"v":0,"d":"$0.00"}]
["Diesel Fuel - Tractors",1.57,"gallons",{"$f":"'Universal Input Prices'!$B$32","v":{"v":1.81,"d":"$1.81"}},{"v":0,"d":"0%"},{"v":2.8417000000000003,"d":"$2.84"},{"v":2.8417000000000003,"d":"$2.84"},{"v":0,"d":"$0.00"}]
["Gasoline - Pickup",4.51,"gallons",{"$f":"'Universal Input Prices'!$B$33","v":{"v":1.926,"d":"$1.93"}},{"v":0,"d":"0%"},{"v":8.686259999999999,"d":"$8.69"},{"v":8.686259999999999,"d":"$8.69"},{"v":0,"d":"$0.00"}]
["Irrigation Fuel",{"v":7,"d":"7.00"},"acin",{"$f":"'Universal Input Prices'!$B$34","v":{"v":3.6,"d":"$3.60"}},{"v":0.33,"d":"33%"},{"v":25.2,"d":"$25.20"},{"v":16.883999999999997,"d":"$16.88"},{"v":8.316,"d":"$8.32"}]
["Pumping Days",{"v":66,"d":"66.00"}]
["Calculated GPM capacity per acre needed",{"$f":"B37*18.85694/B38","v":{"v":1.999978484848485,"d":"2.00"}}]
["Repair & Maintenance"]
["Implements",{"v":1,"d":"1.00"},"acre",{"v":8.82,"d":"$8.82"},{"v":0,"d":"0%"},{"$f":"D41*B41","v":{"v":8.82,"d":"$8.82"}},{"$f":"F41*(1-E41)","v":{"v":8.82,"d":"$8.82"}},{"$f":"F41*E41","v":{"v":0,"d":"$0.00"}}]
["Tractors",{"v":1,"d":"1.00"},"acre",{"v":3.28,"d":"$3.28"},{"v":0,"d":"0%"},{"$f":"D42*B42","v":{"v":3.28,"d":"$3.28"}},{"$f":"F42*(1-E42)","v":{"v":3.28,"d":"$3.28"}},{"$f":"F42*E42","v":{"v":0,"d":"$0.00"}}]
["Irrigation-Above Ground",{"$f":"B37","v":{"v":7,"d":"7.00"}},"acin",{"v":4.04,"d":"$4.04"},{"v":0,"d":"0%"},{"$f":"D43*B43","v":{"v":28.28,"d":"$28.28"}},{"$f":"F43*(1-E43)","v":{"v":28.28,"d":"$28.28"}},{"$f":"F43*E43","v":{"v":0,"d":"$0.00"}}]
["Self Propelled Equipment",{"v":1,"d":"1.00"},"acre",{"v":0,"d":"$0.00"},{"v":1,"d":"100%"},{"$f":"D44*B44","v":{"v":0,"d":"$0.00"}},{"$f":"F44*(1-E44)","v":{"v":0,"d":"$0.00"}},{"$f":"F44*E44","v":{"v":0,"d":"$0.00"}}]
["Pickup",{"v":1,"d":"1.00"},"acre",{"v":5.52,"d":"$5.52"},{"v":0,"d":"0%"},{"$f":"D45*B45","v":{"v":5.52,"d":"$5.52"}},{"$f":"F45*(1-E45)","v":{"v":5.52,"d":"$5.52"}},{"$f":"F45*E45","v":{"v":0,"d":"$0.00"}}]
["Interest-operating capital",{"$f":"'Universal Input Prices'!$B$35","v":{"v":0.054,"d":"5.40%"}},{"$nulls":3},{"$f":"(SUM(F15:F23,F26:F45))*$B46/2.1","v":{"v":6.26428922142857,"d":"$6.26"}},{"$f":"(SUM(G15:G23,G26:G45))*$B46/2","v":{"v":5.307018429375,"d":"$5.31"}},{"v":1.2704852531250002,"d":"$1.27"}]
[]
["Total Variable Costs",{"$nulls":4},{"$f":"SUM(F15:F46)","v":{"v":283.8755367214285,"d":"$283.88"}},{"$f":"SUM(G15:G46)","v":{"v":224.643256554375,"d":"$224.64"}},{"$f":"SUM(H15:H46)","v":{"v":59.545494628125,"d":"$59.55"}}]
["Returns Above Variable Costs",{"$nulls":4},{"$f":"F12-F48","v":{"v":46.12446327857151,"d":"$46.12"}},{"$f":"G12-G48","v":{"v":-3.5432565543750343,"d":"($3.54)"}},{"$f":"H12-H48","v":{"v":49.35450537187501,"d":"$49.35"}}]
[]
["Fixed Costs"]
["Implements",{"v":1,"d":"1.00"},"acre",{"v":14.08,"d":"$14.08"},{"v":0,"d":"0%"},{"$f":"D52*B52","v":{"v":14.08,"d":"$14.08"}},{"$f":"F52*(1-E52)","v":{"v":14.08,"d":"$14.08"}},{"$f":"F52*E52","v":{"v":0,"d":"$0.00"}}]
["Tractors",{"v":1,"d":"1.00"},"acre",{"v":4.88,"d":"$4.88"},{"v":0,"d":"0%"},{"v":4.88,"d":"$4.88"},{"v":4.88,"d":"$4.88"},{"v":0,"d":"$0.00"}]
["Irrigation Equipment",{"v":1,"d":"1.00"},"acre",{"v":28.8,"d":"$28.80"},{"v":0,"d":"0%"},{"v":28.8,"d":"$28.80"},{"v":28.8,"d":"$28.80"},{"v":0,"d":"$0.00"}]
["Self Propelled Equipment",{"v":1,"d":"1.00"},"acre",{"v":0,"d":"$0.00"},{"v":1,"d":"100%"},{"v":0,"d":"$0.00"},{"v":0,"d":"$0.00"},{"v":0,"d":"$0.00"}]
["Pickup",{"v":1,"d":"1.00"},"acre",{"v":8.05,"d":"$8.05"},{"v":0,"d":"0%"},{"v":8.05,"d":"$8.05"},{"v":8.05,"d":"$8.05"},{"v":0,"d":"$0.00"}]
["Management",{"v":1,"d":"1.00"},"acre",{"v":0,"d":"$0.00"},{"v":0,"d":"0%"},{"v":0,"d":"$0.00"},{"v":0,"d":"$0.00"},{"v":0,"d":"$0.00"}]
["Irrigation Investment",{"v":1,"d":"1.00"},"acre",{"v":24.62,"d":"$24.62"},{"v":0,"d":"0%"},{"$f":"B58*D58","v":{"v":24.62,"d":"$24.62"}},{"v":24.62,"d":"$24.62"},{"v":0,"d":"$0.00"}]
["Land",{"v":1,"d":"1.00"},"acre",{"v":72,"d":"$72.00"},{"v":1,"d":"100%"},{"$f":"D59*B59","v":{"v":72,"d":"$72.00"}},{"$f":"IF($H$6=\"Cash\",D59,F59*(1-E59))","v":{"v":0,"d":"$0.00"}},{"$f":"IF($H$6=\"Cash\",0,F59*E59)","v":{"v":72,"d":"$72.00"}}]
["Property Tax",{"v":1,"d":"1.00"},"acre",{"v":0,"d":"$0.00"},{"v":1,"d":"100%"},{"$f":"B60*D60","v":{"v":0,"d":"$0.00"}},{"v":0,"d":"$0.00"},{"v":0,"d":"$0.00"}]
["Total Fixed Expenses",{"$nulls":4},{"$f":"SUM(F52:F60)","v":{"v":152.43,"d":"$152.43"}},{"$f":"SUM(G52:G60)","v":{"v":80.43,"d":"$80.43"}},{"$f":"SUM(H52:H60)","v":{"v":72,"d":"$72.00"}}]
["Total Specified Expenses",{"$nulls":4},{"$f":"F48+F61","v":{"v":436.3055367214285,"d":"$436.31"}},{"$f":"G48+G61","v":{"v":305.073256554375,"d":"$305.07"}},{"$f":"H48+H61","v":{"v":131.545494628125,"d":"$131.55"}}]
["Returns Above Total Specified Expenses",{"$nulls":4},{"$f":"F12-F62","v":{"v":-106.3055367214285,"d":"($106.31)"}},{"$f":"G12-G62","v":{"v":-83.97325655437504,"d":"($83.97)"}},{"$f":"H12-H62","v":{"v":-22.645494628124993,"d":"($22.65)"}}]
[]
["Return on Investment",{"$nulls":4},{"$f":"(F63/F62)","v":{"v":-0.24364929567534285,"d":"-24.36%"}},{"$f":"(G63/G62)","v":{"v":-0.27525604014853394,"d":"-27.53%"}},{"v":-0.17214952661163424,"d":"-17.21%"}]

{"sheet":"Irr Triticale Silage","index":16,"n_rows":63,"n_cols":9,"rows_kept":63,"merged":[[1,0,1,7],[2,0,2,7],[3,0,3,7]]}
[]
[" Estimated Costs and Returns per Acre"]
["Irrigated Triticale Silage"]
["Projected for 2016"]
[{"$nulls":7},"Rental Agreement","Share"]
["Item ","Quantity","Unit","Price","Landlord"," ",null,"Share","Cash"]
[{"$nulls":4},"Share","Total","Tenant","Landlord"]
["Income"]
["triticale silage",{"v":10,"d":"10.00"},"ton",{"$f":"'Universal Input Prices'!$B$17","v":{"v":31.6,"d":"$31.60"}},{"v":0.33,"d":"33%"},{"$f":"D9*B9","v":{"v":316,"d":"$316.00"}},{"$f":"F9*(1-E9)","v":{"v":211.71999999999997,"d":"$211.72"}},{"$f":"IF(H6=\"Cash\", D57,F9*E9)","v":{"v":104.28,"d":"$104.28"}}]
["other income",{"v":0,"d":"0.00"},"$/ac.",{"v":1,"d":"$1.00"},{"v":0.33,"d":"33%"},{"$f":"D10*B10","v":{"v":0,"d":"$0.00"}},{"$f":"F10*(1-E10)","v":{"v":0,"d":"$0.00"}},{"$f":"IF(H7=\"Cash\", D59,F10*E10)","v":{"v":0,"d":"$0.00"}}]
[]
["Total Income",{"$nulls":4},{"$f":"SUM(F7:F11)","v":{"v":316,"d":"$316.00"}},{"$f":"SUM(G7:G11)","v":{"v":211.71999999999997,"d":"$211.72"}},{"$f":"SUM(H7:H11)","v":{"v":104.28,"d":"$104.28"}}]
[]
["Variable Costs"]
["Seed",{"v":0.6,"d":"0.60"},"cwt",{"v":36.6,"d":"$36.60"},{"v":0,"d":"0%"},{"$f":"D15*B15","v":{"v":21.96,"d":"$21.96"}},{"$f":"F15*(1-E15)","v":{"v":21.96,"d":"$21.96"}},{"$f":"F15*E15","v":{"v":0,"d":"$0.00"}}]
["Fertilizer"]
["fert (N) - NH3 ",{"v":60,"d":"60.0"},"lb",{"$f":"IF(A17=\"\",0,VLOOKUP(A17,'Universal Input Prices'!$A$26:$B$30, 2))","v":{"v":0.25000000000000006,"d":"$0.250"}},{"v":0.33,"d":"33%"},{"$f":"D17*B17","v":{"v":15.000000000000004,"d":"$15.00"}},{"$f":"F17*(1-E17)","v":{"v":10.05,"d":"$10.05"}},{"$f":"F17*E17","v":{"v":4.950000000000001,"d":"$4.95"}}]
["fert (P) - liquid",{"v":40,"d":"40.0"},"lb",{"$f":"IF(A18=\"\",0,VLOOKUP(A18,'Universal Input Prices'!$A$26:$B$30, 2))","v":{"v":0.47,"d":"$0.470"}},{"v":0.33,"d":"33%"},{"$f":"D18*B18","v":{"v":18.799999999999997,"d":"$18.80"}},{"$f":"F18*(1-E18)","v":{"v":12.595999999999997,"d":"$12.60"}},{"$f":"F18*E18","v":{"v":6.204,"d":"$6.20"}}]
["fert (N) - liquid",{"v":30,"d":"30.0"},"lb",{"$f":"IF(A19=\"\",0,VLOOKUP(A19,'Universal Input Prices'!$A$26:$B$30, 2))","v":{"v":0.41015625,"d":"$0.410"}},{"v":0,"d":"0%"},{"$f":"D19*B19","v":{"v":12.3046875,"d":"$12.30"}},{"$f":"F19*(1-E19)","v":{"v":12.3046875,"d":"$12.30"}},{"$f":"F19*E19","v":{"v":0,"d":"$0.00"}}]
["Field Operations"]
["herbicide & application",{"v":1,"d":"1.0"},"acre",{"v":0,"d":"$0.00"},{"v":0.33,"d":"33%"},{"$f":"D21*B21","v":{"v":0,"d":"$0.00"}},{"$f":"F21*(1-E21)","v":{"v":0,"d":"$0.00"}},{"$f":"F21*E21","v":{"v":0,"d":"$0.00"}}]
["fertilizer application",{"v":1,"d":"1.0"},"acre",{"v":15,"d":"$15.00"},{"v":0.33,"d":"33%"},{"v":15,"d":"$15.00"},{"v":10.049999999999999,"d":"$10.05"},{"v":4.95,"d":"$4.95"}]
["insecticide & application",{"v":1,"d":"1.0"},"acre",{"v":8.9,"d":"$8.90"},{"v":0.33,"d":"33%"},{"v":8.9,"d":"$8.90"},{"v":5.962999999999999,"d":"$5.96"},{"v":2.9370000000000003,"d":"$2.94"}]
["custom harvest & haul",{"$f":"$B$9","v":{"v":10,"d":"10.00"}},"ton",{"v":9,"d":"$9.00"},{"v":0,"d":"0%"},{"v":90,"d":"$90.00"},{"v":90,"d":"$90.00"},{"v":0,"d":"$0.00"}]
["crop consultant",{"v":1,"d":"1.0"},"acre",{"v":0,"d":"$0.00"},{"v":0,"d":"0%"},{"v":0,"d":"$0.00"},{"v":0,"d":"$0.00"},{"v":0,"d":"$0.00"}]
["scouting",{"v":1,"d":"1.0"},"acre",{"v":0,"d":"$0.00"},{"v":0,"d":"0%"},{"$f":"D26*B26","v":{"v":0,"d":"$0.00"}},{"$f":"F26*(1-E26)","v":{"v":0,"d":"$0.00"}},{"$f":"F26*E26","v":{"v":0,"d":"$0.00"}}]
["other ",{"v":1,"d":"1.0"},"acre",{"v":0,"d":"$0.00"},{"v":0,"d":"0%"},{"v":0,"d":"$0.00"},{"v":0,"d":"$0.00"},{"v":0,"d":"$0.00"}]
["other ",{"v":1,"d":"1.0"},"acre",{"v":0,"d":"$0.00"},{"v":0,"d":"0%"},{"v":0,"d":"$0.00"},{"v":0,"d":"$0.00"},{"v":0,"d":"$0.00"}]
["other ",{"v":1,"d":"1.0"},"acre",{"v":0,"d":"$0.00"},{"v":0,"d":"0%"},{"v":0,"d":"$0.00"},{"v":0,"d":"$0.00"},{"v":0,"d":"$0.00"}]
["Crop Insurance",{"v":1,"d":"1.0"},"acre",{"v":0,"d":"$0.00"},{"v":0.33,"d":"33%"},{"v":0,"d":"$0.00"},{"v":0,"d":"$0.00"},{"v":0,"d":"$0.00"}]
["Operator Labor & Hand Labor",{"v":0.855,"d":"0.9"},"hour",{"$f":"'Universal Input Prices'!$B$31","v":{"v":12.45,"d":"$12.45"}},{"v":0,"d":"0%"},{"v":10.644749999999998,"d":"$10.64"},{"v":10.644749999999998,"d":"$10.64"},{"v":0,"d":"$0.00"}]
["Irrigation Labor",0.96,"hours",{"$f":"'Universal Input Prices'!$B$31","v":{"v":12.45,"d":"$12.45"}},{"v":0,"d":"0%"},{"v":11.951999999999998,"d":"$11.95"},{"v":11.951999999999998,"d":"$11.95"},{"v":0,"d":"$0.00"}]
["Diesel Fuel - Tractors",2.12,"gallons",{"$f":"'Universal Input Prices'!$B$32","v":{"v":1.81,"d":"$1.81"}},{"v":0,"d":"0%"},{"v":3.8372,"d":"$3.84"},{"v":3.8372,"d":"$3.84"},{"v":0,"d":"$0.00"}]
["Gasoline - Pickup",{"v":2.0485,"d":"2.05"},"gallons",{"$f":"'Universal Input Prices'!$B$33","v":{"v":1.926,"d":"$1.93"}},{"v":0,"d":"0%"},{"v":3.9454110000000004,"d":"$3.95"},{"v":3.9454110000000004,"d":"$3.95"},{"v":0,"d":"$0.00"}]
["Irrigation Fuel",{"v":10,"d":"10.00"},"acin",{"$f":"'Universal Input Prices'!$B$34","v":{"v":3.6,"d":"$3.60"}},{"v":0.33,"d":"33%"},{"v":36,"d":"$36.00"},{"v":24.119999999999997,"d":"$24.12"},{"v":11.88,"d":"$11.88"}]
["Pumping Days",70.04]
["Calculated GPM capacity per acre needed",{"$f":"B35*18.85694/B36","v":{"v":2.692310108509423,"d":"2.69"}}]
["Repair & Maintenance",{"$nulls":5},{"v":0,"d":"$0.00"},{"v":0,"d":"$0.00"}]
["Implements",{"v":1,"d":"1.00"},"acre",{"v":11.98,"d":"$11.98"},{"v":0,"d":"0%"},{"$f":"D39*B39","v":{"v":11.98,"d":"$11.98"}},{"v":11.98,"d":"$11.98"},{"v":0,"d":"$0.00"}]
["Tractors",{"v":1,"d":"1.00"},"acre",{"v":3.78,"d":"$3.78"},{"v":0,"d":"0%"},{"$f":"D40*B40","v":{"v":3.78,"d":"$3.78"}},{"v":3.78,"d":"$3.78"},{"v":0,"d":"$0.00"}]
["Irrigation-Above Ground",{"$f":"B35","v":{"v":10,"d":"10.00"}},"acin",{"v":4.04,"d":"$4.04"},{"v":0,"d":"0%"},{"$f":"D41*B41","v":{"v":40.4,"d":"$40.40"}},{"v":40.4,"d":"$40.40"},{"v":0,"d":"$0.00"}]
["Self Propelled Equipment",{"v":1,"d":"1.00"},"acre",{"v":0,"d":"$0.00"},{"v":1,"d":"100%"},{"$f":"D42*B42","v":{"v":0,"d":"$0.00"}},{"v":0,"d":"$0.00"},{"v":0,"d":"$0.00"}]
["Pickup",{"v":1,"d":"1.00"},"acre",{"v":2.51,"d":"$2.51"},{"v":0,"d":"0%"},{"$f":"D43*B43","v":{"v":2.51,"d":"$2.51"}},{"v":2.51,"d":"$2.51"},{"v":0,"d":"$0.00"}]
["Interest-operating capital",{"$f":"'Universal Input Prices'!$B$35","v":{"v":0.054,"d":"5.40%"}},{"$nulls":3},{"$f":"(SUM(F15:F23,F25:F43))*$B44/1.7","v":{"v":6.893387422941177,"d":"$6.89"}},{"$f":"(SUM(G15:G23,G25:G43))*$B44/2","v":{"v":5.0245123094999995,"d":"$5.02"}},{"v":0.834867,"d":"$0.83"}]
[]
["Total Variable Costs",{"$nulls":4},{"$f":"SUM(F15:F44)","v":{"v":313.90743592294115,"d":"$313.91"}},{"$f":"SUM(G15:G44)","v":{"v":281.11756080949993,"d":"$281.12"}},{"$f":"SUM(H15:H44)","v":{"v":31.755867,"d":"$31.76"}}]
["Returns Above Variable Costs",{"$nulls":4},{"$f":"F12-F46","v":{"v":2.092564077058853,"d":"$2.09"}},{"$f":"G12-G46","v":{"v":-69.39756080949996,"d":"($69.40)"}},{"$f":"H12-H46","v":{"v":72.524133,"d":"$72.52"}}]
[]
["Fixed Costs"]
["Implements",{"v":1,"d":"1.00"},"acre",{"v":18.79,"d":"$18.79"},{"v":0,"d":"0%"},{"$f":"D50*B50","v":{"v":18.79,"d":"$18.79"}},{"$f":"F50*(1-E50)","v":{"v":18.79,"d":"$18.79"}},{"$f":"F50*E50","v":{"v":0,"d":"$0.00"}}]
["Tractors",{"v":1,"d":"1.00"},"acre",{"v":5.4,"d":"$5.40"},{"v":0,"d":"0%"},{"v":5.4,"d":"$5.40"},{"v":5.4,"d":"$5.40"},{"v":0,"d":"$0.00"}]
["Irrigation Equipment",{"v":1,"d":"1.00"},"acre",{"v":33.5,"d":"$33.50"},{"v":0,"d":"0%"},{"v":33.5,"d":"$33.50"},{"v":33.5,"d":"$33.50"},{"v":0,"d":"$0.00"}]
["Self Propelled Equipment",{"v":1,"d":"1.00"},"acre",{"v":0,"d":"$0.00"},{"v":1,"d":"100%"},{"v":0,"d":"$0.00"},{"v":0,"d":"$0.00"},{"v":0,"d":"$0.00"}]
["Pickup",{"v":1,"d":"1.00"},"acre",{"v":3.66,"d":"$3.66"},{"v":0,"d":"0%"},{"v":3.66,"d":"$3.66"},{"v":3.66,"d":"$3.66"},{"v":0,"d":"$0.00"}]
["Management",{"v":1,"d":"1.00"},"acre",{"v":0,"d":"$0.00"},{"v":0,"d":"0%"},{"v":0,"d":"$0.00"},{"v":0,"d":"$0.00"},{"v":0,"d":"$0.00"}]
["Irrigation Investment",{"v":1,"d":"1.00"},"acre",{"v":26.57,"d":"$26.57"},{"v":0,"d":"0%"},{"$f":"B56*D56","v":{"v":26.57,"d":"$26.57"}},{"v":26.57,"d":"$26.57"},{"v":0,"d":"$0.00"}]
["Land",{"v":1,"d":"1.00"},"acre",{"v":72,"d":"$72.00"},{"v":1,"d":"100%"},{"$f":"D57*B57","v":{"v":72,"d":"$72.00"}},{"$f":"IF($H$6=\"Cash\",D57,F57*(1-E57))","v":{"v":0,"d":"$0.00"}},{"$f":"IF($H$6=\"Cash\",0,F57*E57)","v":{"v":72,"d":"$72.00"}}]
["Property Tax",{"v":1,"d":"1.00"},"acre",{"v":0,"d":"$0.00"},{"v":1,"d":"100%"},{"$f":"B58*D58","v":{"v":0,"d":"$0.00"}},{"v":0,"d":"$0.00"},{"v":0,"d":"$0.00"}]
["Total Fixed Expenses",{"$nulls":4},{"$f":"SUM(F50:F58)","v":{"v":159.92,"d":"$159.92"}},{"$f":"SUM(G50:G58)","v":{"v":87.91999999999999,"d":"$87.92"}},{"$f":"SUM(H50:H58)","v":{"v":72,"d":"$72.00"}}]
["Total Specified Expenses",{"$nulls":4},{"$f":"F46+F59","v":{"v":473.82743592294116,"d":"$473.83"}},{"$f":"G46+G59","v":{"v":369.03756080949995,"d":"$369.04"}},{"$f":"H46+H59","v":{"v":103.755867,"d":"$103.76"}}]
["Returns Above Total Specified Expenses",{"$nulls":4},{"$f":"F12-F60","v":{"v":-157.82743592294116,"d":"($157.83)"}},{"$f":"G12-G60","v":{"v":-157.31756080949998,"d":"($157.32)"}},{"$f":"H12-H60","v":{"v":0.5241330000000062,"d":"$0.52"}}]
[]
["Return on Investment",{"$nulls":4},{"$f":"(F61/F60)","v":{"v":-0.3330905387855353,"d":"-33.31%"}},{"$f":"(G61/G60)","v":{"v":-0.4262914605885023,"d":"-42.63%"}},{"v":0.00505159867248766,"d":"0.51%"}]

{"sheet":"Irr Wheat","index":17,"n_rows":64,"n_cols":9,"rows_kept":64,"merged":[[1,0,1,7],[2,0,2,7],[3,0,3,7]]}
[]
[" Estimated Costs and Returns per Acre"]
["Irrigated Wheat"]
["Projected for 2016"]
[{"$nulls":7},"Rental Agreement","Share"]
["Item ","Quantity","Unit","Price","Landlord"," ",null,"Share","Cash"]
[{"$nulls":4},"Share","Total","Tenant","Landlord"]
["Income"]
["wheat",{"v":50,"d":"50.0"},"bu",{"$f":"'Universal Input Prices'!$B$18","v":{"v":3.95,"d":"$3.95"}},{"v":0.33,"d":"33%"},{"$f":"D9*B9","v":{"v":197.5,"d":"$197.50"}},{"$f":"F9*(1-E9)","v":{"v":132.325,"d":"$132.33"}},{"$f":"IF(H6=\"Cash\", D58,F9*E9)","v":{"v":65.175,"d":"$65.18"}}]
["grazing",{"v":136,"d":"136.00"},"lb",{"$f":"Grazing_Price","v":{"v":0.4,"d":"$0.400"}},{"v":0.33,"d":"33%"},{"$f":"D10*B10","v":{"v":54.400000000000006,"d":"$54.40"}},{"$f":"F10*(1-E10)","v":{"v":36.448,"d":"$36.45"}},{"$f":"IF(H6=\"Cash\", 0,F10*E10)","v":{"v":17.952,"d":"$17.95"}}]
["other income",{"v":0,"d":"0.00"},"$/ac.",{"v":1,"d":"$1.00"},{"v":0.33,"d":"33%"},{"$f":"D11*B11","v":{"v":0,"d":"$0.00"}},{"$f":"F11*(1-E11)","v":{"v":0,"d":"$0.00"}},{"$f":"IF(H8=\"Cash\", D60,F11*E11)","v":{"v":0,"d":"$0.00"}}]
[]
["Total Income",{"$nulls":4},{"$f":"SUM(F8:F12)","v":{"v":251.9,"d":"$251.90"}},{"$f":"SUM(G8:G12)","v":{"v":168.773,"d":"$168.77"}},{"$f":"SUM(H8:H12)","v":{"v":83.127,"d":"$83.13"}}]
[]
["Variable Costs"]
["Seed",{"v":1,"d":"1.00"},"bu",{"v":23.7,"d":"$23.700"},{"v":0,"d":"0%"},{"$f":"D16*B16","v":{"v":23.7,"d":"$23.70"}},{"$f":"F16*(1-E16)","v":{"v":23.7,"d":"$23.70"}},{"$f":"F16*E16","v":{"v":0,"d":"$0.00"}}]
["Fertilizer"]
["fert (N) - NH3 ",{"v":50,"d":"50.0"},"lb",{"$f":"IF(A18=\"\",0,VLOOKUP(A18,'Universal Input Prices'!$A$26:$B$30, 2))","v":{"v":0.25000000000000006,"d":"$0.250"}},{"v":0.33,"d":"33%"},{"$f":"D18*B18","v":{"v":12.500000000000004,"d":"$12.50"}},{"$f":"F18*(1-E18)","v":{"v":8.375000000000002,"d":"$8.38"}},{"$f":"F18*E18","v":{"v":4.125000000000002,"d":"$4.13"}}]
["fert (P) - liquid",{"v":30,"d":"30.0"},"lb",{"$f":"IF(A19=\"\",0,VLOOKUP(A19,'Universal Input Prices'!$A$26:$B$30, 2))","v":{"v":0.47,"d":"$0.470"}},{"v":0.33,"d":"33%"},{"$f":"D19*B19","v":{"v":14.1,"d":"$14.10"}},{"$f":"F19*(1-E19)","v":{"v":9.447,"d":"$9.45"}},{"$f":"F19*E19","v":{"v":4.6530000000000005,"d":"$4.65"}}]
["fert (N) - liquid",{"v":25,"d":"25.0"},"lb",{"$f":"IF(A20=\"\",0,VLOOKUP(A20,'Universal Input Prices'!$A$26:$B$27, 2))","v":{"v":0.41015625,"d":"$0.410"}},{"v":0.33,"d":"33%"},{"$f":"D20*B20","v":{"v":10.25390625,"d":"$10.25"}},{"$f":"F20*(1-E20)","v":{"v":6.870117187499999,"d":"$6.87"}},{"$f":"F20*E20","v":{"v":3.3837890625,"d":"$3.38"}}]
["Field Operations"]
["herbicide & application",{"v":1,"d":"1.0"},"acre",{"v":0,"d":"$0.00"},{"v":0.33,"d":"33%"},{"$f":"D22*B22","v":{"v":0,"d":"$0.00"}},{"$f":"F22*(1-E22)","v":{"v":0,"d":"$0.00"}},{"$f":"F22*E22","v":{"v":0,"d":"$0.00"}}]
["fertilizer application",{"v":1,"d":"1.0"},"acre",{"v":15,"d":"$15.00"},{"v":0.33,"d":"33%"},{"v":15,"d":"$15.00"},{"v":10.049999999999999,"d":"$10.05"},{"v":4.95,"d":"$4.95"}]
["insecticide & application",{"v":1,"d":"1.0"},"acre",{"v":8.9,"d":"$8.90"},{"v":0.33,"d":"33%"},{"v":8.9,"d":"$8.90"},{"v":5.962999999999999,"d":"$5.96"},{"v":2.9370000000000003,"d":"$2.94"}]
["custom harvest & haul",{"$f":"B9","v":{"v":50,"d":"50.0"}},"bu.",{"v":0.6,"d":"$0.60"},{"v":0,"d":"0%"},{"v":30,"d":"$30.00"},{"v":30,"d":"$30.00"},{"v":0,"d":"$0.00"}]
["hoeing",{"v":0,"d":"0.0"},"acre",{"v":0,"d":"$0.00"},{"v":0,"d":"0%"},{"v":0,"d":"$0.00"},{"v":0,"d":"$0.00"},{"v":0,"d":"$0.00"}]
["scouting",{"v":1,"d":"1.0"},"acre",{"v":0,"d":"$0.00"},{"v":0,"d":"0%"},{"$f":"D27*B27","v":{"v":0,"d":"$0.00"}},{"$f":"F27*(1-E27)","v":{"v":0,"d":"$0.00"}},{"$f":"F27*E27","v":{"v":0,"d":"$0.00"}}]
["other ",{"v":1,"d":"1.0"},"acre",{"v":0,"d":"$0.00"},{"v":0,"d":"0%"},{"v":0,"d":"$0.00"},{"v":0,"d":"$0.00"},{"v":0,"d":"$0.00"}]
["other ",{"v":1,"d":"1.0"},"acre",{"v":0,"d":"$0.00"},{"v":0,"d":"0%"},{"v":0,"d":"$0.00"},{"v":0,"d":"$0.00"},{"v":0,"d":"$0.00"}]
["other ",{"v":1,"d":"1.0"},"acre",{"v":0,"d":"$0.00"},{"v":0,"d":"0%"},{"v":0,"d":"$0.00"},{"v":0,"d":"$0.00"},{"v":0,"d":"$0.00"}]
["Crop Insurance",{"v":1,"d":"1.0"},"acre",{"v":33,"d":"$33.00"},{"v":0.33,"d":"33%"},{"v":33,"d":"$33.00"},{"v":22.11,"d":"$22.11"},{"v":10.89,"d":"$10.89"}]
["Operator Labor & Hand Labor",{"v":0.855,"d":"0.86"},"hours",{"$f":"'Universal Input Prices'!$B$31","v":{"v":12.45,"d":"$12.45"}},{"v":0,"d":"0%"},{"v":10.644749999999998,"d":"$10.64"},{"v":10.644749999999998,"d":"$10.64"},{"v":0,"d":"$0.00"}]
["Irrigation Labor",0.96,"hours",{"$f":"'Universal Input Prices'!$B$31","v":{"v":12.45,"d":"$12.45"}},{"v":0,"d":"0%"},{"v":11.951999999999998,"d":"$11.95"},{"v":11.951999999999998,"d":"$11.95"},{"v":0,"d":"$0.00"}]
["Diesel Fuel - Tractors",2.12,"gallons",{"$f":"'Universal Input Prices'!$B$32","v":{"v":1.81,"d":"$1.81"}},{"v":0,"d":"0%"},{"v":3.8372,"d":"$3.84"},{"v":3.8372,"d":"$3.84"},{"v":0,"d":"$0.00"}]
["Gasoline - Pickup",{"v":2.04923,"d":"2.05"},"gallons",{"$f":"'Universal Input Prices'!$B$33","v":{"v":1.926,"d":"$1.93"}},{"v":0,"d":"0%"},{"v":3.94681698,"d":"$3.95"},{"v":3.94681698,"d":"$3.95"},{"v":0,"d":"$0.00"}]
["Irrigation Fuel",{"v":10,"d":"10.00"},"acin",{"$f":"'Universal Input Prices'!$B$34","v":{"v":3.6,"d":"$3.60"}},{"v":0.33,"d":"33%"},{"v":36,"d":"$36.00"},{"v":24.119999999999997,"d":"$24.12"},{"v":11.88,"d":"$11.88"}]
["Pumping Days",70.71]
["Calculated GPM capacity per acre needed",{"$f":"B36*18.85694/B37","v":{"v":2.6667996040164055,"d":"2.67"}}]
["Repair & Maintenance"]
["Implements",{"v":1,"d":"1.00"},"acre",{"v":11.98,"d":"$11.98"},{"v":0,"d":"0%"},{"$f":"D40*B40","v":{"v":11.98,"d":"$11.98"}},{"v":11.98,"d":"$11.98"},{"v":0,"d":"$0.00"}]
["Tractors",{"v":1,"d":"1.00"},"acre",{"v":3.78,"d":"$3.78"},{"v":0,"d":"0%"},{"$f":"D41*B41","v":{"v":3.78,"d":"$3.78"}},{"v":3.78,"d":"$3.78"},{"v":0,"d":"$0.00"}]
["Irrigation-Above Ground",{"$f":"B36","v":{"v":10,"d":"10.00"}},"acin",{"v":4.04,"d":"$4.04"},{"v":0,"d":"0%"},{"$f":"D42*B42","v":{"v":40.4,"d":"$40.40"}},{"v":40.4,"d":"$40.40"},{"v":0,"d":"$0.00"}]
["Self Propelled Equipment",{"v":1,"d":"1.00"},"acre",{"v":0,"d":"$0.00"},{"v":1,"d":"100%"},{"$f":"D43*B43","v":{"v":0,"d":"$0.00"}},{"v":0,"d":"$0.00"},{"v":0,"d":"$0.00"}]
["Pickup",{"v":1,"d":"1.00"},"acre",{"v":2.51,"d":"$2.51"},{"v":0,"d":"0%"},{"$f":"D44*B44","v":{"v":2.51,"d":"$2.51"}},{"v":2.51,"d":"$2.51"},{"v":0,"d":"$0.00"}]
["Interest-operating capital",{"$f":"'Universal Input Prices'!$B$35","v":{"v":0.054,"d":"5.40%"}},{"$nulls":3},{"$f":"(SUM(F16:F24,F26:F44))*$B45/1.62","v":{"v":8.083489107666665,"d":"$8.08"}},{"$f":"(SUM(G16:G24,G26:G44))*$B45/2","v":{"v":5.391518872522499,"d":"$5.39"}},{"v":1.1561073046875001,"d":"$1.16"}]
[]
["Total Variable Costs",{"$nulls":4},{"$f":"SUM(F16:F45)","v":{"v":280.58816233766663,"d":"$280.59"}},{"$f":"SUM(G16:G45)","v":{"v":235.0774030400225,"d":"$235.08"}},{"$f":"SUM(H16:H45)","v":{"v":43.974896367187505,"d":"$43.97"}}]
["Returns Above Variable Costs",{"$nulls":4},{"$f":"F13-F47","v":{"v":-28.688162337666625,"d":"($28.69)"}},{"$f":"G13-G47","v":{"v":-66.30440304002249,"d":"($66.30)"}},{"$f":"H13-H47","v":{"v":39.15210363281249,"d":"$39.15"}}]
[]
["Fixed Costs"]
["Implements",{"v":1,"d":"1.00"},"acre",{"v":18.79,"d":"$18.79"},{"v":0,"d":"0%"},{"$f":"D51*B51","v":{"v":18.79,"d":"$18.79"}},{"$f":"F51*(1-E51)","v":{"v":18.79,"d":"$18.79"}},{"$f":"F51*E51","v":{"v":0,"d":"$0.00"}}]
["Tractors",{"v":1,"d":"1.00"},"acre",{"v":5.4,"d":"$5.40"},{"v":0,"d":"0%"},{"v":5.4,"d":"$5.40"},{"v":5.4,"d":"$5.40"},{"v":0,"d":"$0.00"}]
["Irrigation Equipment",{"v":1,"d":"1.00"},"acre",{"v":33.5,"d":"$33.50"},{"v":0,"d":"0%"},{"v":33.5,"d":"$33.50"},{"v":33.5,"d":"$33.50"},{"v":0,"d":"$0.00"}]
["Self Propelled Equipment",{"v":1,"d":"1.00"},"acre",{"v":0,"d":"$0.00"},{"v":1,"d":"100%"},{"v":0,"d":"$0.00"},{"v":0,"d":"$0.00"},{"v":0,"d":"$0.00"}]
["Pickup",{"v":1,"d":"1.00"},"acre",{"v":3.66,"d":"$3.66"},{"v":0,"d":"0%"},{"v":3.66,"d":"$3.66"},{"v":3.66,"d":"$3.66"},{"v":0,"d":"$0.00"}]
["Management",{"v":1,"d":"1.00"},"acre",{"v":0,"d":"$0.00"},{"v":0,"d":"0%"},{"v":0,"d":"$0.00"},{"v":0,"d":"$0.00"},{"v":0,"d":"$0.00"}]
["Irrigation Investment",{"v":1,"d":"1.00"},"acre",{"v":26.57,"d":"$26.57"},{"v":0,"d":"0%"},{"$f":"B57*D57","v":{"v":26.57,"d":"$26.57"}},{"v":26.57,"d":"$26.57"},{"v":0,"d":"$0.00"}]
["Land",{"v":1,"d":"1.00"},"acre",{"v":72,"d":"$72.00"},{"v":1,"d":"100%"},{"$f":"D58*B58","v":{"v":72,"d":"$72.00"}},{"$f":"IF($H$6=\"Cash\",D58,F58*(1-E58))","v":{"v":0,"d":"$0.00"}},{"$f":"IF($H$6=\"Cash\",0,F58*E58)","v":{"v":72,"d":"$72.00"}}]
["Property Tax",{"v":1,"d":"1.00"},"acre",{"v":0,"d":"$0.00"},{"v":1,"d":"100%"},{"$f":"B59*D59","v":{"v":0,"d":"$0.00"}},{"v":0,"d":"$0.00"},{"v":0,"d":"$0.00"}]
["Total Fixed Expenses",{"$nulls":4},{"$f":"SUM(F51:F59)","v":{"v":159.92,"d":"$159.92"}},{"$f":"SUM(G51:G59)","v":{"v":87.91999999999999,"d":"$87.92"}},{"$f":"SUM(H51:H59)","v":{"v":72,"d":"$72.00"}}]
["Total Specified Expenses",{"$nulls":4},{"$f":"F47+F60","v":{"v":440.5081623376666,"d":"$440.51"}},{"$f":"G47+G60","v":{"v":322.9974030400225,"d":"$323.00"}},{"$f":"H47+H60","v":{"v":115.97489636718751,"d":"$115.97"}}]
["Returns Above Total Specified Expenses",{"$nulls":4},{"$f":"F13-F61","v":{"v":-188.60816233766658,"d":"($188.61)"}},{"$f":"G13-G61","v":{"v":-154.2244030400225,"d":"($154.22)"}},{"$f":"H13-H61","v":{"v":-32.847896367187516,"d":"($32.85)"}}]
[]
["Return on Investment",{"$nulls":4},{"$f":"(F62/F61)","v":{"v":-0.4281604257609445,"d":"-42.82%"}},{"$f":"(G62/G61)","v":{"v":-0.47747877100086966,"d":"-47.75%"}},{"v":-0.2832328149980662,"d":"-28.32%"}]

{"sheet":"Irr Other Crop","index":18,"n_rows":65,"n_cols":9,"rows_kept":65,"merged":[[1,0,1,7],[2,0,2,7],[3,0,3,7]]}
[]
[" Estimated Costs and Returns per Acre"]
[{"$f":"'Universal Input Prices'!A19","v":"Irrigated Other Crop"}]
["Projected for 2016"]
[{"$nulls":7},"Rental Agreement","Share"]
["Item ","Quantity","Unit","Price","Landlord"," ",null,"Share","Cash"]
[{"$nulls":4},"Share","Total","Tenant","Landlord"]
["Income"]
["other irrigated crop",{"v":0,"d":"0.0"},{"$f":"'Universal Input Prices'!C19","v":"unit"},{"$f":"'Universal Input Prices'!B19","v":{"v":0,"d":"$0.00"}},{"v":0.33,"d":"33%"},{"$f":"D9*B9","v":{"v":0,"d":"$0.00"}},{"$f":"F9*(1-E9)","v":{"v":0,"d":"$0.00"}},{"$f":"IF(H6=\"Cash\", D59,F9*E9)","v":{"v":0,"d":"$0.00"}}]
["secondary income",{"v":0,"d":"0.00"},{"$f":"'Universal Input Prices'!C20","v":"unit"},{"v":0,"d":"$0.00"},{"v":0.33,"d":"33%"},{"$f":"D10*B10","v":{"v":0,"d":"$0.00"}},{"$f":"F10*(1-E10)","v":{"v":0,"d":"$0.00"}},{"$f":"IF(H6=\"Cash\", 0,F10*E10)","v":{"v":0,"d":"$0.00"}}]
[]
["Total Income",{"$nulls":4},{"$f":"F9+F10","v":{"v":0,"d":"$0.00"}},{"$f":"G9+G10","v":{"v":0,"d":"$0.00"}},{"$f":"H9+H10","v":{"v":0,"d":"$0.00"}}]
[]
["Variable Costs"]
["Seed",{"v":0,"d":"0.00"},"unit",{"v":0,"d":"$0.000"},{"v":0,"d":"0%"},{"$f":"D15*B15","v":{"v":0,"d":"$0.00"}},{"$f":"F15*(1-E15)","v":{"v":0,"d":"$0.00"}},{"$f":"F15*E15","v":{"v":0,"d":"$0.00"}}]
["Fertilizer"]
["fert (N) - NH3 ",{"v":0,"d":"0.0"},"lb",{"$f":"IF(A17=\"\",0,VLOOKUP(A17,'Universal Input Prices'!$A$26:$B$30, 2))","v":{"v":0.25000000000000006,"d":"$0.250"}},{"v":0.33,"d":"33%"},{"$f":"D17*B17","v":{"v":0,"d":"$0.00"}},{"$f":"F17*(1-E17)","v":{"v":0,"d":"$0.00"}},{"$f":"F17*E17","v":{"v":0,"d":"$0.00"}}]
["fert (N) - dry",{"v":0,"d":"0.0"},"lb",{"$f":"IF(A18=\"\",0,VLOOKUP(A18,'Universal Input Prices'!$A$26:$B$30, 2))","v":{"v":0.33043478260869563,"d":"$0.330"}},{"v":0.33,"d":"33%"},{"v":0,"d":"$0.00"},{"v":0,"d":"$0.00"},{"v":0,"d":"$0.00"}]
["fert (N) - liquid",{"v":0,"d":"0.0"},"lb",{"$f":"IF(A19=\"\",0,VLOOKUP(A19,'Universal Input Prices'!$A$26:$B$30, 2))","v":{"v":0.41015625,"d":"$0.410"}},{"v":0.33,"d":"33%"},{"$f":"D19*B19","v":{"v":0,"d":"$0.00"}},{"$f":"F19*(1-E19)","v":{"v":0,"d":"$0.00"}},{"$f":"F19*E19","v":{"v":0,"d":"$0.00"}}]
["fert (P) - dry",{"v":0,"d":"0.0"},"lb",{"$f":"IF(A20=\"\",0,VLOOKUP(A20,'Universal Input Prices'!$A$26:$B$30, 2))","v":{"v":0.42980769230769234,"d":"$0.430"}},{"v":0.33,"d":"33%"},{"$f":"D20*B20","v":{"v":0,"d":"$0.00"}},{"$f":"F20*(1-E20)","v":{"v":0,"d":"$0.00"}},{"$f":"F20*E20","v":{"v":0,"d":"$0.00"}}]
["fert (P) - liquid",{"v":0,"d":"0.0"},"lb",{"$f":"IF(A21=\"\",0,VLOOKUP(A21,'Universal Input Prices'!$A$26:$B$30, 2))","v":{"v":0.47,"d":"$0.470"}},{"v":0.33,"d":"33%"},{"$f":"D21*B21","v":{"v":0,"d":"$0.00"}},{"$f":"F21*(1-E21)","v":{"v":0,"d":"$0.00"}},{"$f":"F21*E21","v":{"v":0,"d":"$0.00"}}]
["Field Operations"]
["herbicide & application",{"v":1,"d":"1.0"},"acre",{"v":0,"d":"$0.00"},{"v":0.33,"d":"33%"},{"$f":"D23*B23","v":{"v":0,"d":"$0.00"}},{"$f":"F23*(1-E23)","v":{"v":0,"d":"$0.00"}},{"$f":"F23*E23","v":{"v":0,"d":"$0.00"}}]
["fertilizer application",{"v":0,"d":"0.0"},"acre",{"v":11.75,"d":"$11.75"},{"v":0.33,"d":"33%"},{"v":0,"d":"$0.00"},{"v":0,"d":"$0.00"},{"v":0,"d":"$0.00"}]
["insecticide & application",{"v":0,"d":"0.0"},"acre",{"v":0,"d":"$0.00"},{"v":0.33,"d":"33%"},{"v":0,"d":"$0.00"},{"v":0,"d":"$0.00"},{"v":0,"d":"$0.00"}]
["custom harvest & haul",{"$f":"B9","v":{"v":0,"d":"0.0"}},{"$f":"C9","v":"unit"},{"v":0,"d":"$0.00"},{"v":0,"d":"0%"},{"v":0,"d":"$0.00"},{"v":0,"d":"$0.00"},{"v":0,"d":"$0.00"}]
["crop consulting",{"v":1,"d":"1.0"},"acre",{"v":0,"d":"$0.00"},{"v":0,"d":"0%"},{"v":0,"d":"$0.00"},{"v":0,"d":"$0.00"},{"v":0,"d":"$0.00"}]
["scouting",{"v":1,"d":"1.0"},"acre",{"v":0,"d":"$0.00"},{"v":0,"d":"0%"},{"$f":"D28*B28","v":{"v":0,"d":"$0.00"}},{"$f":"F28*(1-E28)","v":{"v":0,"d":"$0.00"}},{"$f":"F28*E28","v":{"v":0,"d":"$0.00"}}]
["other ",{"v":1,"d":"1.0"},"acre",{"v":0,"d":"$0.00"},{"v":0,"d":"0%"},{"v":0,"d":"$0.00"},{"v":0,"d":"$0.00"},{"v":0,"d":"$0.00"}]
["other ",{"v":1,"d":"1.0"},"acre",{"v":0,"d":"$0.00"},{"v":0,"d":"0%"},{"v":0,"d":"$0.00"},{"v":0,"d":"$0.00"},{"v":0,"d":"$0.00"}]
["other ",{"v":1,"d":"1.0"},"acre",{"v":0,"d":"$0.00"},{"v":0,"d":"0%"},{"v":0,"d":"$0.00"},{"v":0,"d":"$0.00"},{"v":0,"d":"$0.00"}]
["Crop Insurance",{"v":1,"d":"1.0"},"acre",{"v":0,"d":"$0.00"},{"v":0.33,"d":"33%"},{"v":0,"d":"$0.00"},{"v":0,"d":"$0.00"},{"v":0,"d":"$0.00"}]
["Operator Labor & Hand Labor",{"v":0,"d":"0.00"},"hours",{"$f":"'Universal Input Prices'!$B$31","v":{"v":12.45,"d":"$12.45"}},{"v":0,"d":"0%"},{"v":0,"d":"$0.00"},{"v":0,"d":"$0.00"},{"v":0,"d":"$0.00"}]
["Irrigation Labor",{"v":0,"d":"0.00"},"hours",{"$f":"'Universal Input Prices'!$B$31","v":{"v":12.45,"d":"$12.45"}},{"v":0,"d":"0%"},{"v":0,"d":"$0.00"},{"v":0,"d":"$0.00"},{"v":0,"d":"$0.00"}]
["Diesel Fuel - Tractors",{"v":0,"d":"0.00"},"gallons",{"$f":"'Universal Input Prices'!$B$32","v":{"v":1.81,"d":"$1.81"}},{"v":0,"d":"0%"},{"v":0,"d":"$0.00"},{"v":0,"d":"$0.00"},{"v":0,"d":"$0.00"}]
["Gasoline - Pickup",{"v":0,"d":"0.00"},"gallons",{"$f":"'Universal Input Prices'!$B$33","v":{"v":1.926,"d":"$1.93"}},{"v":0,"d":"0%"},{"v":0,"d":"$0.00"},{"v":0,"d":"$0.00"},{"v":0,"d":"$0.00"}]
["Irrigation Fuel",{"v":0,"d":"0.00"},"acin",{"$f":"'Universal Input Prices'!$B$34","v":{"v":3.6,"d":"$3.60"}},{"v":0.33,"d":"33%"},{"v":0,"d":"$0.00"},{"v":0,"d":"$0.00"},{"v":0,"d":"$0.00"}]
["Pumping Days",70.71]
["Calculated GPM capacity per acre needed",{"$f":"B37*18.85694/B38","v":{"v":0,"d":"0.00"}}]
["Repair & Maintenance"]
["Implements",{"v":0,"d":"0.00"},"acre",{"v":4.47,"d":"$4.47"},{"v":0,"d":"0%"},{"$f":"D41*B41","v":{"v":0,"d":"$0.00"}},{"v":0,"d":"$0.00"},{"v":0,"d":"$0.00"}]
["Tractors",{"v":0,"d":"0.00"},"acre",{"v":5.55,"d":"$5.55"},{"v":0,"d":"0%"},{"$f":"D42*B42","v":{"v":0,"d":"$0.00"}},{"v":0,"d":"$0.00"},{"v":0,"d":"$0.00"}]
["Irrigation-Above Ground",{"$f":"Other_Inches","v":{"v":0,"d":"0.00"}},"acin",{"v":4.04,"d":"$4.04"},{"v":0,"d":"0%"},{"$f":"D43*B43","v":{"v":0,"d":"$0.00"}},{"v":0,"d":"$0.00"},{"v":0,"d":"$0.00"}]
["Self Propelled Equipment",{"v":0,"d":"0.00"},"acre",{"v":0.16,"d":"$0.16"},{"v":1,"d":"100%"},{"$f":"D44*B44","v":{"v":0,"d":"$0.00"}},{"v":0,"d":"$0.00"},{"v":0,"d":"$0.00"}]
["Pickup",{"v":1,"d":"1.00"},"acre",{"v":0,"d":"$0.00"},{"v":0,"d":"0%"},{"$f":"D45*B45","v":{"v":0,"d":"$0.00"}},{"v":0,"d":"$0.00"},{"v":0,"d":"$0.00"}]
["Interest-operating capital",{"$f":"'Universal Input Prices'!$B$35","v":{"v":0.054,"d":"5.40%"}},{"$nulls":3},{"$f":"(SUM(F15:F25,F27:F45))*$B46/2","v":{"v":0,"d":"$0.00"}},{"$f":"(SUM(G15:G25,G27:G45))*$B46/2","v":{"v":0,"d":"$0.00"}},{"v":0,"d":"$0.00"}]
[]
["Total Variable Costs",{"$nulls":4},{"$f":"SUM(F15:F46)","v":{"v":0,"d":"$0.00"}},{"$f":"SUM(G15:G46)","v":{"v":0,"d":"$0.00"}},{"$f":"SUM(H15:H46)","v":{"v":0,"d":"$0.00"}}]
["Returns Above Variable Costs",{"$nulls":4},{"$f":"F12-F48","v":{"v":0,"d":"$0.00"}},{"$f":"G12-G48","v":{"v":0,"d":"$0.00"}},{"$f":"H12-H48","v":{"v":0,"d":"$0.00"}}]
[]
["Fixed Costs"]
["Implements",{"v":0,"d":"0.00"},"acre",{"v":7.04,"d":"$7.04"},{"v":0,"d":"0%"},{"$f":"D52*B52","v":{"v":0,"d":"$0.00"}},{"$f":"F52*(1-E52)","v":{"v":0,"d":"$0.00"}},{"$f":"F52*E52","v":{"v":0,"d":"$0.00"}}]
["Tractors",{"v":0,"d":"0.00"},"acre",{"v":7.89,"d":"$7.89"},{"v":0,"d":"0%"},{"v":0,"d":"$0.00"},{"v":0,"d":"$0.00"},{"v":0,"d":"$0.00"}]
["Irrigation-Above Ground",{"v":0,"d":"0.00"},"acre",{"v":35.56,"d":"$35.56"},{"v":0,"d":"0%"},{"v":0,"d":"$0.00"},{"v":0,"d":"$0.00"},{"v":0,"d":"$0.00"}]
["Self Propelled Equipment",{"v":0,"d":"0.00"},"acre",{"v":0.24,"d":"$0.24"},{"v":1,"d":"100%"},{"v":0,"d":"$0.00"},{"v":0,"d":"$0.00"},{"v":0,"d":"$0.00"}]
["Pickup",{"v":1,"d":"1.00"},"acre",{"v":0,"d":"$0.00"},{"v":0,"d":"0%"},{"v":0,"d":"$0.00"},{"v":0,"d":"$0.00"},{"v":0,"d":"$0.00"}]
["Management",{"v":1,"d":"1.00"},"acre",{"v":0,"d":"$0.00"},{"v":0,"d":"0%"},{"v":0,"d":"$0.00"},{"v":0,"d":"$0.00"},{"v":0,"d":"$0.00"}]
["Whole Farm Insurance",{"v":1,"d":"1.00"},"acre",{"v":0,"d":"$0.00"},{"v":0,"d":"0%"},{"$f":"B58*D58","v":{"v":0,"d":"$0.00"}},{"v":0,"d":"$0.00"},{"v":0,"d":"$0.00"}]
["Land",{"v":0,"d":"0.00"},"acre",{"v":85,"d":"$85.00"},{"v":1,"d":"100%"},{"$f":"D59*B59","v":{"v":0,"d":"$0.00"}},{"$f":"IF($H$6=\"Cash\",D59,F59*(1-E59))","v":{"v":0,"d":"$0.00"}},{"$f":"IF($H$6=\"Cash\",0,F59*E59)","v":{"v":0,"d":"$0.00"}}]
["Property Tax",{"v":1,"d":"1.00"},"acre",{"v":0,"d":"$0.00"},{"v":1,"d":"100%"},{"$f":"B60*D60","v":{"v":0,"d":"$0.00"}},{"v":0,"d":"$0.00"},{"v":0,"d":"$0.00"}]
["Total Fixed Expenses",{"$nulls":4},{"$f":"SUM(F52:F60)","v":{"v":0,"d":"$0.00"}},{"$f":"SUM(G52:G60)","v":{"v":0,"d":"$0.00"}},{"$f":"SUM(H52:H60)","v":{"v":0,"d":"$0.00"}}]
["Total Specified Expenses",{"$nulls":4},{"$f":"F48+F61","v":{"v":0,"d":"$0.00"}},{"$f":"G48+G61","v":{"v":0,"d":"$0.00"}},{"$f":"H48+H61","v":{"v":0,"d":"$0.00"}}]
["Returns Above Total Specified Expenses",{"$nulls":4},{"$f":"F12-F62","v":{"v":0,"d":"$0.00"}},{"$f":"G12-G62","v":{"v":0,"d":"$0.00"}},{"$f":"H12-H62","v":{"v":0,"d":"$0.00"}}]
[]
["Return on Investment",{"$nulls":4},{"$f":"IF(F62=0,\"-\",(F63/F62))","v":"-"},{"$f":"IF(G62=0,\"-\",(G63/G62))","v":"-"},"-"]

{"sheet":"Dry Canola","index":19,"n_rows":62,"n_cols":9,"rows_kept":62,"merged":[[1,0,1,7],[2,0,2,7],[3,0,3,7]]}
[]
[" Estimated Costs and Returns per Acre"]
["Dryland Canola"]
["Projected for 2016"]
[{"$nulls":7},"Rental Agreement","Share"]
["Item ","Quantity","Unit","Price","Landlord"," ",null,"Share","Cash"]
[{"$nulls":4},"Share","Total","Tenant","Landlord"]
["Income"]
["canola",{"v":11,"d":"11.00"},"cwt",{"$f":"'Universal Input Prices'!$B$5","v":{"v":13.9,"d":"$13.90"}},{"v":0.33,"d":"33%"},{"$f":"D9*B9","v":{"v":152.9,"d":"$152.90"}},{"$f":"F9*(1-E9)","v":{"v":102.443,"d":"$102.44"}},{"$f":"IF(H6=\"Cash\", D56,F9*E9)","v":{"v":50.457,"d":"$50.46"}}]
["other income",{"v":0,"d":"0.00"},"$/ac.",{"v":1,"d":"$1.00"},{"v":0.33,"d":"33%"},{"$f":"D10*B10","v":{"v":0,"d":"$0.00"}},{"$f":"F10*(1-E10)","v":{"v":0,"d":"$0.00"}},{"$f":"IF(H7=\"Cash\", D59,F10*E10)","v":{"v":0,"d":"$0.00"}}]
[]
["Total Income",{"$nulls":4},{"$f":"SUM(F8:F11)","v":{"v":152.9,"d":"$152.90"}},{"$f":"SUM(G8:G11)","v":{"v":102.443,"d":"$102.44"}},{"$f":"SUM(H8:H11)","v":{"v":50.457,"d":"$50.46"}}]
[]
["Variable Costs"]
["Seed"]
["canola seed",{"v":5,"d":"5.00"},"lb",{"v":6.6,"d":"$6.60"},{"v":0,"d":"0%"},{"$f":"D16*B16","v":{"v":33,"d":"$33.00"}},{"$f":"F16*(1-E16)","v":{"v":33,"d":"$33.00"}},{"$f":"F16*E16","v":{"v":0,"d":"$0.00"}}]
["seed treatment",{"v":1,"d":"1.00"},"acre",{"v":6.7,"d":"$6.70"},{"v":0,"d":"0%"},{"$f":"D17*B17","v":{"v":6.7,"d":"$6.70"}},{"$f":"F17*(1-E17)","v":{"v":6.7,"d":"$6.70"}},{"$f":"F17*E17","v":{"v":0,"d":"$0.00"}}]
["Fertilizer"]
["fert (N) - dry",{"v":35,"d":"35.0"},"lb",{"$f":"IF(A19=\"\",0,VLOOKUP(A19,'Universal Input Prices'!$A$26:$B$26, 2))","v":{"v":0.33043478260869563,"d":"$0.330"}},{"v":0.33,"d":"33%"},{"$f":"D19*B19","v":{"v":11.565217391304348,"d":"$11.57"}},{"$f":"F19*(1-E19)","v":{"v":7.748695652173912,"d":"$7.75"}},{"$f":"F19*E19","v":{"v":3.816521739130435,"d":"$3.82"}}]
[null,{"v":0,"d":"0.0"},"lb",{"$f":"IF(A20=\"\",0,VLOOKUP(A20,'Universal Input Prices'!$A$26:$B$30, 2))","v":{"v":0,"d":"$0.000"}},{"v":0,"d":"0%"},{"$f":"D20*B20","v":{"v":0,"d":"$0.00"}},{"$f":"F20*(1-E20)","v":{"v":0,"d":"$0.00"}},{"$f":"F20*E20","v":{"v":0,"d":"$0.00"}}]
[null,{"v":0,"d":"0.0"},"lb",{"$f":"IF(A21=\"\",0,VLOOKUP(A21,'Universal Input Prices'!$A$26:$B$30, 2))","v":{"v":0,"d":"$0.000"}},{"v":0,"d":"0%"},{"$f":"D21*B21","v":{"v":0,"d":"$0.00"}},{"$f":"F21*(1-E21)","v":{"v":0,"d":"$0.00"}},{"$f":"F21*E21","v":{"v":0,"d":"$0.00"}}]
["Field Operations"]
["herbicide & application",{"v":1,"d":"1.0"},"acre",{"v":14.3,"d":"$14.30"},{"v":0.33,"d":"33%"},{"$f":"D23*B23","v":{"v":14.3,"d":"$14.30"}},{"$f":"F23*(1-E23)","v":{"v":9.581,"d":"$9.58"}},{"$f":"F23*E23","v":{"v":4.719,"d":"$4.72"}}]
["fertilizer application",{"v":1,"d":"1.0"},"acre",{"v":5,"d":"$5.00"},{"v":0.33,"d":"33%"},{"v":5,"d":"$5.00"},{"v":3.3499999999999996,"d":"$3.35"},{"v":1.6500000000000001,"d":"$1.65"}]
["insecticide & application",{"v":1,"d":"1.0"},"acre",{"v":9.55,"d":"$9.55"},{"v":0.33,"d":"33%"},{"v":9.55,"d":"$9.55"},{"v":6.398499999999999,"d":"$6.40"},{"v":3.1515000000000004,"d":"$3.15"}]
["custom harvest & haul",{"v":1,"d":"1.0"},"acre",{"v":25,"d":"$25.00"},{"v":0,"d":"0%"},{"v":25,"d":"$25.00"},{"v":25,"d":"$25.00"},{"v":0,"d":"$0.00"}]
["custom harvest & haul",{"$f":"B9","v":{"v":11,"d":"11.00"}},"cwt",{"v":0.45,"d":"$0.45"},{"v":0,"d":"0%"},{"v":4.95,"d":"$4.95"},{"v":4.95,"d":"$4.95"},{"v":0,"d":"$0.00"}]
["hoeing",{"v":0,"d":"0.0"},"acre",{"v":0,"d":"$0.00"},{"v":0,"d":"0%"},{"v":0,"d":"$0.00"},{"v":0,"d":"$0.00"},{"v":0,"d":"$0.00"}]
["scouting",{"v":1,"d":"1.0"},"acre",{"v":0,"d":"$0.00"},{"v":0,"d":"0%"},{"v":0,"d":"$0.00"},{"v":0,"d":"$0.00"},{"v":0,"d":"$0.00"}]
["other ",{"v":1,"d":"1.0"},"acre",{"v":0,"d":"$0.00"},{"v":0,"d":"0%"},{"v":0,"d":"$0.00"},{"v":0,"d":"$0.00"},{"v":0,"d":"$0.00"}]
["other ",{"v":1,"d":"1.0"},"acre",{"v":0,"d":"$0.00"},{"v":0,"d":"0%"},{"v":0,"d":"$0.00"},{"v":0,"d":"$0.00"},{"v":0,"d":"$0.00"}]
["other ",{"v":1,"d":"1.0"},"acre",{"v":0,"d":"$0.00"},{"v":0,"d":"0%"},{"v":0,"d":"$0.00"},{"v":0,"d":"$0.00"},{"v":0,"d":"$0.00"}]
["Crop Insurance",{"v":1,"d":"1.0"},"acre",{"v":0,"d":"$0.00"},{"v":0,"d":"0%"},{"v":0,"d":"$0.00"},{"v":0,"d":"$0.00"},{"v":0,"d":"$0.00"}]
["Operator Labor & Hand Labor",{"v":0.855,"d":"0.86"},"hours",{"$f":"'Universal Input Prices'!$B$31","v":{"v":12.45,"d":"$12.45"}},{"v":0,"d":"0%"},{"v":10.644749999999998,"d":"$10.64"},{"v":10.644749999999998,"d":"$10.64"},{"v":0,"d":"$0.00"}]
["Diesel Fuel - Tractors",2.22,"gallons",{"$f":"'Universal Input Prices'!$B$32","v":{"v":1.81,"d":"$1.81"}},{"v":0,"d":"0%"},{"v":4.0182,"d":"$4.02"},{"v":4.0182,"d":"$4.02"},{"v":0,"d":"$0.00"}]
["Gasoline - Pickup",{"v":2.030769,"d":"2.03"},"gallons",{"$f":"'Universal Input Prices'!$B$33","v":{"v":1.926,"d":"$1.93"}},{"v":0,"d":"0%"},{"v":3.9112610939999994,"d":"$3.91"},{"v":3.9112610939999994,"d":"$3.91"},{"v":0,"d":"$0.00"}]
["Repair & Maintenance"]
["Implements",{"v":1,"d":"1.00"},"acre",{"v":10.59,"d":"$10.59"},{"v":0,"d":"0%"},{"$f":"D38*B38","v":{"v":10.59,"d":"$10.59"}},{"$f":"F38*(1-E38)","v":{"v":10.59,"d":"$10.59"}},{"$f":"F38*E38","v":{"v":0,"d":"$0.00"}}]
["Tractors",{"v":1,"d":"1.00"},"acre",{"v":4.18,"d":"$4.18"},{"v":0,"d":"0%"},{"$f":"D39*B39","v":{"v":4.18,"d":"$4.18"}},{"$f":"F39*(1-E39)","v":{"v":4.18,"d":"$4.18"}},{"$f":"F39*E39","v":{"v":0,"d":"$0.00"}}]
["Other Fixed Expenses",{"v":1,"d":"1.00"},"acre",{"v":0,"d":"$0.00"},{"v":0,"d":"0%"},{"v":0,"d":"$0.00"},{"$f":"F40*(1-E40)","v":{"v":0,"d":"$0.00"}},{"$f":"F40*E40","v":{"v":0,"d":"$0.00"}}]
["Self Propelled Equipment",{"v":1,"d":"1.00"},"acre",{"v":0,"d":"$0.00"},{"v":1,"d":"100%"},{"$f":"D41*B41","v":{"v":0,"d":"$0.00"}},{"$f":"F41*(1-E41)","v":{"v":0,"d":"$0.00"}},{"$f":"F41*E41","v":{"v":0,"d":"$0.00"}}]
["Pickup",{"v":1,"d":"1.00"},"acre",{"v":2.49,"d":"$2.49"},{"v":0,"d":"0%"},{"$f":"D42*B42","v":{"v":2.49,"d":"$2.49"}},{"$f":"F42*(1-E42)","v":{"v":2.49,"d":"$2.49"}},{"$f":"F42*E42","v":{"v":0,"d":"$0.00"}}]
["Interest-operating capital",{"$f":"'Universal Input Prices'!$B$35","v":{"v":0.054,"d":"5.40%"}},{"$nulls":3},{"$f":"(SUM(F16:F25,F28:F42))*$B43/1.8","v":{"v":3.4784828545591306,"d":"$3.48"}},{"$f":"(SUM(G16:G25,G28:G42))*$B43/2","v":{"v":2.770534982146696,"d":"$2.77"}},{"$f":"(SUM(H16:H25,H28:H42))*$B43/2","v":{"v":0.3600995869565217,"d":"$0.36"}}]
[]
["Total Variable Costs",{"$nulls":4},{"$f":"SUM(F15:F43)","v":{"v":149.3779113398635,"d":"$149.38"}},{"$f":"SUM(G15:G43)","v":{"v":135.33294172832063,"d":"$135.33"}},{"$f":"SUM(H15:H43)","v":{"v":13.697121326086958,"d":"$13.70"}}]
["Returns Above Variable Costs",{"$nulls":4},{"$f":"F12-F45","v":{"v":3.522088660136518,"d":"$3.52"}},{"$f":"G12-G45","v":{"v":-32.889941728320636,"d":"($32.89)"}},{"$f":"H12-H45","v":{"v":36.75987867391304,"d":"$36.76"}}]
[]
["Fixed Costs"]
["Implements",{"v":1,"d":"1.00"},"acre",{"v":17.07,"d":"$17.07"},{"v":0,"d":"0%"},{"$f":"D49*B49","v":{"v":17.07,"d":"$17.07"}},{"$f":"F49*(1-E49)","v":{"v":17.07,"d":"$17.07"}},{"$f":"F49*E49","v":{"v":0,"d":"$0.00"}}]
["Tractors",{"v":1,"d":"1.00"},"acre",{"v":5.99,"d":"$5.99"},{"v":0,"d":"0%"},{"v":5.99,"d":"$5.99"},{"v":5.99,"d":"$5.99"},{"v":0,"d":"$0.00"}]
["Other Fixed Expenses",{"v":1,"d":"1.00"},"acre",{"v":0,"d":"$0.00"},{"v":1,"d":"100%"},{"v":0,"d":"$0.00"},{"v":0,"d":"$0.00"},{"v":0,"d":"$0.00"}]
["Self Propelled Equipment",{"v":1,"d":"1.00"},"acre",{"v":0,"d":"$0.00"},{"v":1,"d":"100%"},{"v":0,"d":"$0.00"},{"v":0,"d":"$0.00"},{"v":0,"d":"$0.00"}]
["Pickup",{"v":1,"d":"1.00"},"acre",{"v":3.63,"d":"$3.63"},{"v":0,"d":"0%"},{"v":3.63,"d":"$3.63"},{"v":3.63,"d":"$3.63"},{"v":0,"d":"$0.00"}]
["Management",{"v":1,"d":"1.00"},"acre",{"v":0,"d":"$0.00"},{"v":0,"d":"0%"},{"v":0,"d":"$0.00"},{"v":0,"d":"$0.00"},{"v":0,"d":"$0.00"}]
["Whole Farm Insurance",{"v":1,"d":"1.00"},"acre",{"v":0,"d":"$0.00"},{"v":0,"d":"0%"},{"$f":"B55*D55","v":{"v":0,"d":"$0.00"}},{"v":0,"d":"$0.00"},{"v":0,"d":"$0.00"}]
["Land",{"v":1,"d":"1.00"},"acre",{"v":26.5,"d":"$26.50"},{"v":1,"d":"100%"},{"$f":"D56*B56","v":{"v":26.5,"d":"$26.50"}},{"$f":"IF($H$6=\"Cash\",D56,F56*(1-E56))","v":{"v":0,"d":"$0.00"}},{"$f":"IF($H$6=\"Cash\",0,F56*E56)","v":{"v":26.5,"d":"$26.50"}}]
["Property Tax",{"v":1,"d":"1.00"},"acre",{"v":0,"d":"$0.00"},{"v":1,"d":"100%"},{"$f":"B57*D57","v":{"v":0,"d":"$0.00"}},{"v":0,"d":"$0.00"},{"v":0,"d":"$0.00"}]
["Total Fixed Expenses",{"$nulls":4},{"$f":"SUM(F49:F57)","v":{"v":53.19,"d":"$53.19"}},{"$f":"SUM(G49:G57)","v":{"v":26.69,"d":"$26.69"}},{"$f":"SUM(H49:H57)","v":{"v":26.5,"d":"$26.50"}}]
["Total Specified Expenses",{"$nulls":4},{"$f":"F45+F58","v":{"v":202.56791133986349,"d":"$202.57"}},{"$f":"G45+G58","v":{"v":162.02294172832063,"d":"$162.02"}},{"$f":"H45+H58","v":{"v":40.19712132608696,"d":"$40.20"}}]
["Returns Above Total Specified Expenses",{"$nulls":4},{"$f":"F12-F59","v":{"v":-49.66791133986348,"d":"($49.67)"}},{"$f":"G12-G59","v":{"v":-59.579941728320634,"d":"($59.58)"}},{"$f":"H12-H59","v":{"v":10.259878673913043,"d":"$10.26"}}]
[]
["Return on Investment",{"$nulls":4},{"$f":"(F60/F59)","v":{"v":-0.24519140771774,"d":"-24.52%"}},{"$f":"(G60/G59)","v":{"v":-0.36772534242850635,"d":"-36.77%"}},{"v":0.25523913990464364,"d":"25.52%"}]

{"sheet":"Dry Cotton","index":20,"n_rows":66,"n_cols":9,"rows_kept":66,"merged":[[1,0,1,7],[2,0,2,7],[3,0,3,7]]}
[]
[" Estimated Costs and Returns per Acre"]
["Dryland Cotton"]
["Projected for 2016"]
[{"$nulls":7},"Rental Agreement","Share"]
["Item ","Quantity","Unit","Price","Landlord"," ",null,"Share","Cash"]
[{"$nulls":4},"Share","Total","Tenant","Landlord"]
["Income"]
["cotton lint",{"v":400,"d":"400.0"},"lb",{"$f":"'Universal Input Prices'!$B$8","v":{"v":0.65,"d":"$0.6500"}},{"v":0,"d":"0%"},{"$f":"D9*B9","v":{"v":260,"d":"$260.00"}},{"$f":"F9*(1-E9)","v":{"v":260,"d":"$260.00"}},{"$f":"IF(H6=\"Cash\", D60,F9*E9)","v":{"v":0,"d":"$0.00"}}]
["cotton seed",{"$f":"B9/500*'Universal Input Prices'!B39/2000","v":{"v":0.3,"d":"0.300"}},"tons",{"$f":"'Universal Input Prices'!$B$9","v":{"v":200,"d":"$200.00"}},{"v":0,"d":"0%"},{"$f":"D10*B10","v":{"v":60,"d":"$60.00"}},{"$f":"F10*(1-E10)","v":{"v":60,"d":"$60.00"}},{"$f":"IF(H6=\"Cash\", 0,F10*E10)","v":{"v":0,"d":"$0.00"}}]
["Expected Turnout",{"v":0.2222,"d":"22.2%"}]
["other income",{"v":0,"d":"0.00"},"$/ac.",{"v":1,"d":"$1.00"},{"v":0,"d":"0%"},{"$f":"D12*B12","v":{"v":0,"d":"$0.00"}},{"$f":"F12*(1-E12)","v":{"v":0,"d":"$0.00"}},{"$f":"IF(H9=\"Cash\", D61,F12*E12)","v":{"v":0,"d":"$0.00"}}]
["Total Income",{"$nulls":4},{"$f":"SUM(F9:F12)","v":{"v":320,"d":"$320.00"}},{"$f":"SUM(G9:G12)","v":{"v":320,"d":"$320.00"}},{"$f":"SUM(H9:H12)","v":{"v":0,"d":"$0.00"}}]
[]
["Variable Costs"]
["Seed"]
["cotton seed",0.18,"bag",{"v":350,"d":"$350.000"},{"v":0,"d":"0%"},{"$f":"D17*B17","v":{"v":63,"d":"$63.00"}},{"$f":"F17*(1-E17)","v":{"v":63,"d":"$63.00"}},{"$f":"F17*E17","v":{"v":0,"d":"$0.00"}}]
["Boll Weevil  Assess.-Dry",{"v":1,"d":"1.0"},"acre",{"v":0.7,"d":"$0.70"},{"v":0,"d":"0%"},{"$f":"D18*B18","v":{"v":0.7,"d":"$0.70"}},{"$f":"F18*(1-E18)","v":{"v":0.7,"d":"$0.70"}},{"$f":"F18*E18","v":{"v":0,"d":"$0.00"}}]
["Fertilizer"]
["fert (P) - dry",{"v":20,"d":"20.0"},"lb",{"$f":"IF(A20=\"\",0,VLOOKUP(A20,'Universal Input Prices'!$A$26:$B$30, 2))","v":{"v":0.42980769230769234,"d":"$0.430"}},{"v":0,"d":"0%"},{"$f":"D20*B20","v":{"v":8.596153846153847,"d":"$8.60"}},{"$f":"F20*(1-E20)","v":{"v":8.596153846153847,"d":"$8.60"}},{"$f":"F20*E20","v":{"v":0,"d":"$0.00"}}]
["fert (N) - dry",{"v":30,"d":"30.0"},"lb",{"$f":"IF(A21=\"\",0,VLOOKUP(A21,'Universal Input Prices'!$A$26:$B$30, 2))","v":{"v":0.33043478260869563,"d":"$0.330"}},{"v":0,"d":"0%"},{"$f":"D21*B21","v":{"v":9.91304347826087,"d":"$9.91"}},{"$f":"F21*(1-E21)","v":{"v":9.91304347826087,"d":"$9.91"}},{"$f":"F21*E21","v":{"v":0,"d":"$0.00"}}]
[null,{"v":0,"d":"0.0"},"lb",{"$f":"IF(A22=\"\",0,VLOOKUP(A22,'Universal Input Prices'!$A$26:$B$30, 2))","v":{"v":0,"d":"$0.000"}},{"v":0,"d":"0%"},{"$f":"D22*B22","v":{"v":0,"d":"$0.00"}},{"$f":"F22*(1-E22)","v":{"v":0,"d":"$0.00"}},{"$f":"F22*E22","v":{"v":0,"d":"$0.00"}}]
["Field Operations"]
["preplant herbicide & application",{"v":1,"d":"1.0"},"acre",{"v":14.5,"d":"$14.50"},{"v":0,"d":"0%"},{"$f":"D24*B24","v":{"v":14.5,"d":"$14.50"}},{"$f":"F24*(1-E24)","v":{"v":14.5,"d":"$14.50"}},{"$f":"F24*E24","v":{"v":0,"d":"$0.00"}}]
["post emergence herbicide & application",{"v":1,"d":"1.0"},"acre",{"v":14.3,"d":"$14.30"},{"v":0,"d":"0%"},{"v":14.3,"d":"$14.30"},{"v":14.3,"d":"$14.30"},{"v":0,"d":"$0.00"}]
["clean-up herbicide & application",{"v":1,"d":"1.0"},"acre",{"v":0,"d":"$0.00"},{"v":0,"d":"0%"},{"v":0,"d":"$0.00"},{"v":0,"d":"$0.00"},{"v":0,"d":"$0.00"}]
["fertilizer application",{"v":1,"d":"1.0"},"acre",{"v":5,"d":"$5.00"},{"v":0,"d":"0%"},{"v":5,"d":"$5.00"},{"v":5,"d":"$5.00"},{"v":0,"d":"$0.00"}]
["insecticide & application",0.5,"acre",{"v":9.6,"d":"$9.60"},{"v":0,"d":"0%"},{"v":4.8,"d":"$4.80"},{"v":4.8,"d":"$4.80"},{"v":0,"d":"$0.00"}]
["harvest aids",0.5,"acre",{"v":25,"d":"$25.00"},{"v":0,"d":"0%"},{"v":12.5,"d":"$12.50"},{"v":12.5,"d":"$12.50"},{"v":0,"d":"$0.00"}]
["strip (field cleaner)",{"$f":"B9/100","v":{"v":4,"d":"4.0"}},"cwt.",{"$f":"'Universal Input Prices'!$B$37","v":{"v":8,"d":"$8.000"}},{"v":0,"d":"0%"},{"v":32,"d":"$32.00"},{"v":32,"d":"$32.00"},{"v":0,"d":"$0.00"}]
["ginning",{"$f":"B9/B11/100","v":{"v":18.001800180018,"d":"18.00"}},"cwt.",{"$f":"'Universal Input Prices'!$B$38","v":{"v":2.75,"d":"$2.75"}},{"v":0,"d":"0%"},{"v":49.504950495049506,"d":"$49.50"},{"v":49.504950495049506,"d":"$49.50"},{"v":0,"d":"$0.00"}]
["hoeing",{"v":1,"d":"1.0"},"acre",{"v":0,"d":"$0.00"},{"v":0,"d":"0%"},{"v":0,"d":"$0.00"},{"v":0,"d":"$0.00"},{"v":0,"d":"$0.00"}]
["scouting",{"v":1,"d":"1.0"},"acre",{"v":0,"d":"$0.00"},{"v":0,"d":"0%"},{"$f":"D33*B33","v":{"v":0,"d":"$0.00"}},{"$f":"F33*(1-E33)","v":{"v":0,"d":"$0.00"}},{"$f":"F33*E33","v":{"v":0,"d":"$0.00"}}]
["other ",{"v":1,"d":"1.0"},"acre",{"v":0,"d":"$0.00"},{"v":0,"d":"0%"},{"v":0,"d":"$0.00"},{"v":0,"d":"$0.00"},{"v":0,"d":"$0.00"}]
["other ",{"v":1,"d":"1.0"},"acre",{"v":0,"d":"$0.00"},{"v":0,"d":"0%"},{"v":0,"d":"$0.00"},{"v":0,"d":"$0.00"},{"v":0,"d":"$0.00"}]
["other ",{"v":1,"d":"1.0"},"acre",{"v":0,"d":"$0.00"},{"v":0,"d":"0%"},{"v":0,"d":"$0.00"},{"v":0,"d":"$0.00"},{"v":0,"d":"$0.00"}]
["Crop Insurance",{"v":1,"d":"1.0"},"acre",{"v":25,"d":"$25.00"},{"v":0,"d":"0%"},{"v":25,"d":"$25.00"},{"v":25,"d":"$25.00"},{"v":0,"d":"$0.00"}]
["Operator Labor & Hand Labor",{"v":1.2,"d":"1.20"},"hours",{"$f":"'Universal Input Prices'!$B$31","v":{"v":12.45,"d":"$12.45"}},{"v":0,"d":"0%"},{"v":14.939999999999998,"d":"$14.94"},{"v":14.939999999999998,"d":"$14.94"},{"v":0,"d":"$0.00"}]
["Diesel Fuel - Tractors",3.03,"gallons",{"$f":"'Universal Input Prices'!$B$32","v":{"v":1.81,"d":"$1.81"}},{"v":0,"d":"0%"},{"v":5.4843,"d":"$5.48"},{"v":5.4843,"d":"$5.48"},{"v":0,"d":"$0.00"}]
["Gasoline - Pickup",{"v":2.0307692,"d":"2.03"},"gallons",{"$f":"'Universal Input Prices'!$B$33","v":{"v":1.926,"d":"$1.93"}},{"v":0,"d":"0%"},{"v":3.9112614792,"d":"$3.91"},{"v":3.9112614792,"d":"$3.91"},{"v":0,"d":"$0.00"}]
["Repair & Maintenance"]
["Implements",{"v":1,"d":"1.00"},"acre",{"v":12.27,"d":"$12.27"},{"v":0,"d":"0%"},{"$f":"D42*B42","v":{"v":12.27,"d":"$12.27"}},{"$f":"F42*(1-E42)","v":{"v":12.27,"d":"$12.27"}},{"$f":"F42*E42","v":{"v":0,"d":"$0.00"}}]
["Tractors",{"v":1,"d":"1.00"},"acre",{"v":5.52,"d":"$5.52"},{"v":0,"d":"0%"},{"$f":"D43*B43","v":{"v":5.52,"d":"$5.52"}},{"$f":"F43*(1-E43)","v":{"v":5.52,"d":"$5.52"}},{"$f":"F43*E43","v":{"v":0,"d":"$0.00"}}]
["Other Fixed Expenses",{"v":1,"d":"1.00"},"acre",{"v":0,"d":"$0.00"},{"v":0,"d":"0%"},{"$f":"D44*B44","v":{"v":0,"d":"$0.00"}},{"$f":"F44*(1-E44)","v":{"v":0,"d":"$0.00"}},{"$f":"F44*E44","v":{"v":0,"d":"$0.00"}}]
["Self Propelled Equipment",{"v":1,"d":"1.00"},"acre",{"v":0,"d":"$0.00"},{"v":0,"d":"0%"},{"$f":"D45*B45","v":{"v":0,"d":"$0.00"}},{"$f":"F45*(1-E45)","v":{"v":0,"d":"$0.00"}},{"$f":"F45*E45","v":{"v":0,"d":"$0.00"}}]
["Pickup",{"v":1,"d":"1.00"},"acre",{"v":2.49,"d":"$2.49"},{"v":0,"d":"0%"},{"$f":"D46*B46","v":{"v":2.49,"d":"$2.49"}},{"$f":"F46*(1-E46)","v":{"v":2.49,"d":"$2.49"}},{"$f":"F46*E46","v":{"v":0,"d":"$0.00"}}]
["Interest-operating capital",{"$f":"'Universal Input Prices'!$B$35","v":{"v":0.054,"d":"5.40%"}},{"$nulls":3},{"$f":"(SUM(F17:F28,F32:F46))*$B47/1.8","v":{"v":5.712742764108442,"d":"$5.71"}},{"$f":"(SUM(G17:G28,G32:G46))*$B47/2","v":{"v":5.141468487697598,"d":"$5.14"}},{"$f":"(SUM(H17:H28,H32:H46))*$B47/2","v":{"v":0,"d":"$0.00"}}]
[]
["Total Variable Costs",{"$nulls":4},{"$f":"SUM(F17:F47)","v":{"v":290.14245206277263,"d":"$290.14"}},{"$f":"SUM(G17:G47)","v":{"v":289.5711777863618,"d":"$289.57"}},{"$f":"SUM(H17:H47)","v":{"v":0,"d":"$0.00"}}]
["Returns Above Variable Costs",{"$nulls":4},{"$f":"F13-F49","v":{"v":29.857547937227366,"d":"$29.86"}},{"$f":"G13-G49","v":{"v":30.428822213638227,"d":"$30.43"}},{"$f":"H13-H49","v":{"v":0,"d":"$0.00"}}]
[]
["Fixed Costs"]
["Implements",{"v":1,"d":"1.00"},"acre",{"v":18.92,"d":"$18.92"},{"v":0,"d":"0%"},{"$f":"D53*B53","v":{"v":18.92,"d":"$18.92"}},{"$f":"F53*(1-E53)","v":{"v":18.92,"d":"$18.92"}},{"$f":"F53*E53","v":{"v":0,"d":"$0.00"}}]
["Tractors",{"v":1,"d":"1.00"},"acre",{"v":7.55,"d":"$7.55"},{"v":0,"d":"0%"},{"v":7.55,"d":"$7.55"},{"v":7.55,"d":"$7.55"},{"v":0,"d":"$0.00"}]
["Other Fixed Expenses",{"v":1,"d":"1.00"},"acre",{"v":0,"d":"$0.00"},{"v":0,"d":"0%"},{"v":0,"d":"$0.00"},{"v":0,"d":"$0.00"},{"v":0,"d":"$0.00"}]
["Self Propelled Equipment",{"v":1,"d":"1.00"},"acre",{"v":0,"d":"$0.00"},{"v":0,"d":"0%"},{"v":0,"d":"$0.00"},{"v":0,"d":"$0.00"},{"v":0,"d":"$0.00"}]
["Pickup",{"v":1,"d":"1.00"},"acre",{"v":3.63,"d":"$3.63"},{"v":0,"d":"0%"},{"v":3.63,"d":"$3.63"},{"v":3.63,"d":"$3.63"},{"v":0,"d":"$0.00"}]
["Management",{"v":1,"d":"1.00"},"acre",{"v":0,"d":"$0.00"},{"v":0,"d":"0%"},{"v":0,"d":"$0.00"},{"v":0,"d":"$0.00"},{"v":0,"d":"$0.00"}]
["Whole Farm Insurance",{"v":1,"d":"1.00"},"acre",{"v":0,"d":"$0.00"},{"v":0,"d":"0%"},{"v":0,"d":"$0.00"},{"v":0,"d":"$0.00"},{"v":0,"d":"$0.00"}]
["Land",{"v":1,"d":"1.00"},"acre",{"v":26.5,"d":"$26.50"},{"v":0,"d":"0%"},{"v":26.5,"d":"$26.50"},{"$f":"IF($H$6=\"Cash\",D60,F60*(1-E60))","v":{"v":26.5,"d":"$26.50"}},{"$f":"IF($H$6=\"Cash\",0,F60*E60)","v":{"v":0,"d":"$0.00"}}]
["Property Tax",{"v":1,"d":"1.00"},"acre",{"v":0,"d":"$0.00"},{"v":0,"d":"0%"},{"v":0,"d":"$0.00"},{"v":0,"d":"$0.00"},{"v":0,"d":"$0.00"}]
["Total Fixed Expenses",{"$nulls":4},{"$f":"SUM(F53:F61)","v":{"v":56.6,"d":"$56.60"}},{"$f":"SUM(G53:G61)","v":{"v":56.6,"d":"$56.60"}},{"$f":"SUM(H53:H61)","v":{"v":0,"d":"$0.00"}}]
["Total Specified Expenses",{"$nulls":4},{"$f":"F49+F62","v":{"v":346.74245206277266,"d":"$346.74"}},{"$f":"G49+G62","v":{"v":346.1711777863618,"d":"$346.17"}},{"$f":"H49+H62","v":{"v":0,"d":"$0.00"}}]
["Returns Above Total Specified Expenses",{"$nulls":4},{"$f":"F13-F63","v":{"v":-26.742452062772657,"d":"($26.74)"}},{"$f":"G13-G63","v":{"v":-26.171177786361795,"d":"($26.17)"}},{"$f":"H13-H63","v":{"v":0,"d":"$0.00"}}]
[]
["Return on Investment",{"$nulls":4},{"$f":"(F64/F63)","v":{"v":-0.07712482825129045,"d":"-7.71%"}},{"$f":"(G64/G63)","v":{"v":-0.07560183939551789,"d":"-7.56%"}},{"$error":"#DIV/0!"}]

{"sheet":"Dry Sorghum","index":21,"n_rows":60,"n_cols":9,"rows_kept":60,"merged":[[1,0,1,7],[2,0,2,7],[3,0,3,7]]}
[]
[" Estimated Costs and Returns per Acre"]
["Dryland Sorghum"]
["Projected for 2016"]
[{"$nulls":7},"Rental Agreement","Share"]
["Item ","Quantity","Unit","Price","Landlord"," ",null,"Share","Cash"]
[{"$nulls":4},"Share","Total","Tenant","Landlord"]
["Income"]
["sorghum grain",{"v":25,"d":"25.0"},"cwt",{"$f":"'Universal Input Prices'!$B$11","v":{"v":5.75,"d":"$5.75"}},{"v":0,"d":"0%"},{"$f":"B9*D9","v":{"v":143.75,"d":"$143.75"}},{"$f":"F9*(1-E9)","v":{"v":143.75,"d":"$143.75"}},{"$f":"IF(H6=\"Cash\", D54,F9*E9)","v":{"v":0,"d":"$0.00"}}]
["other income",{"v":0,"d":"0.00"},"$/ac.",{"v":1,"d":"$1.00"},{"v":0,"d":"0%"},{"$f":"D10*B10","v":{"v":0,"d":"$0.00"}},{"$f":"F10*(1-E10)","v":{"v":0,"d":"$0.00"}},{"$f":"IF(H7=\"Cash\", D58,F10*E10)","v":{"v":0,"d":"$0.00"}}]
[]
["Total Income",{"$nulls":4},{"$f":"SUM(F9:F11)","v":{"v":143.75,"d":"$143.75"}},{"$f":"SUM(G9:G11)","v":{"v":143.75,"d":"$143.75"}},{"$f":"SUM(H9:H11)","v":{"v":0,"d":"$0.00"}}]
[]
["Variable Costs"]
["Seed",2.25,"lb",{"v":1.85,"d":"$1.850"},{"v":0,"d":"0%"},{"$f":"D15*B15","v":{"v":4.1625000000000005,"d":"$4.16"}},{"$f":"F15*(1-E15)","v":{"v":4.1625000000000005,"d":"$4.16"}},{"$f":"F15*E15","v":{"v":0,"d":"$0.00"}}]
["Fertilizer"]
["fert (N) - NH3 ",{"v":30,"d":"30.0"},"lb",{"$f":"IF(A17=\"\",0,VLOOKUP(A17,'Universal Input Prices'!$A$26:$B$30, 2))","v":{"v":0.25000000000000006,"d":"$0.250"}},{"v":0,"d":"0%"},{"$f":"D17*B17","v":{"v":7.500000000000002,"d":"$7.50"}},{"$f":"F17*(1-E17)","v":{"v":7.500000000000002,"d":"$7.50"}},{"$f":"F17*E17","v":{"v":0,"d":"$0.00"}}]
[null,{"v":0,"d":"0.0"},"lb",{"$f":"IF(A18=\"\",0,VLOOKUP(A18,'Universal Input Prices'!$A$26:$B$30, 2))","v":{"v":0,"d":"$0.000"}},{"v":0,"d":"0%"},{"$f":"D18*B18","v":{"v":0,"d":"$0.00"}},{"$f":"F18*(1-E18)","v":{"v":0,"d":"$0.00"}},{"$f":"F18*E18","v":{"v":0,"d":"$0.00"}}]
[null,{"v":0,"d":"0.0"},"lb",{"$f":"IF(A19=\"\",0,VLOOKUP(A19,'Universal Input Prices'!$A$26:$B$30, 2))","v":{"v":0,"d":"$0.000"}},{"v":0,"d":"0%"},{"$f":"D19*B19","v":{"v":0,"d":"$0.00"}},{"$f":"F19*(1-E19)","v":{"v":0,"d":"$0.00"}},{"$f":"F19*E19","v":{"v":0,"d":"$0.00"}}]
["Field Operations"]
["herbicide & application",{"v":1,"d":"1.0"},"acre",{"v":19.2,"d":"$19.20"},{"v":0,"d":"0%"},{"$f":"D21*B21","v":{"v":19.2,"d":"$19.20"}},{"$f":"F21*(1-E21)","v":{"v":19.2,"d":"$19.20"}},{"$f":"F21*E21","v":{"v":0,"d":"$0.00"}}]
["fertilizer application",{"v":1,"d":"1.0"},"acre",{"v":15,"d":"$15.00"},{"v":0,"d":"0%"},{"v":15,"d":"$15.00"},{"v":15,"d":"$15.00"},{"v":0,"d":"$0.00"}]
["insecticide headworm",{"v":0.67,"d":"0.7"},"acre",{"v":9.8,"d":"$9.80"},{"v":0,"d":"0%"},{"v":6.566000000000001,"d":"$6.57"},{"v":6.566000000000001,"d":"$6.57"},{"v":0,"d":"$0.00"}]
["custom harvest & haul",{"v":1,"d":"1.0"},"acre",{"v":25,"d":"$25.00"},{"v":0,"d":"0%"},{"v":25,"d":"$25.00"},{"v":25,"d":"$25.00"},{"v":0,"d":"$0.00"}]
["custom harvest & haul",{"$f":"B9","v":{"v":25,"d":"25.0"}},"cwt",{"v":0.25,"d":"$0.25"},{"v":0,"d":"0%"},{"$f":"D25*B25","v":{"v":6.25,"d":"$6.25"}},{"v":6.25,"d":"$6.25"},{"v":0,"d":"$0.00"}]
["hoeing",{"v":1,"d":"1.0"},"acre",{"v":0,"d":"$0.00"},{"v":0,"d":"0%"},{"v":0,"d":"$0.00"},{"v":0,"d":"$0.00"},{"v":0,"d":"$0.00"}]
["scouting",{"v":1,"d":"1.0"},"acre",{"v":0,"d":"$0.00"},{"v":0,"d":"0%"},{"$f":"D27*B27","v":{"v":0,"d":"$0.00"}},{"$f":"F27*(1-E27)","v":{"v":0,"d":"$0.00"}},{"$f":"F27*E27","v":{"v":0,"d":"$0.00"}}]
["insecticide sugar cane aphid",{"v":1,"d":"1.0"},"acre",{"v":21,"d":"$21.00"},{"v":0.33,"d":"33%"},{"v":21,"d":"$21.00"},{"v":14.069999999999999,"d":"$14.07"},{"v":6.930000000000001,"d":"$6.93"}]
["other ",{"v":1,"d":"1.0"},"acre",{"v":0,"d":"$0.00"},{"v":0,"d":"0%"},{"v":0,"d":"$0.00"},{"v":0,"d":"$0.00"},{"v":0,"d":"$0.00"}]
["other ",{"v":1,"d":"1.0"},"acre",{"v":0,"d":"$0.00"},{"v":0,"d":"0%"},{"v":0,"d":"$0.00"},{"v":0,"d":"$0.00"},{"v":0,"d":"$0.00"}]
["Crop Insurance",{"v":1,"d":"1.0"},"acre",{"v":17.4,"d":"$17.40"},{"v":0,"d":"0%"},{"v":17.4,"d":"$17.40"},{"v":17.4,"d":"$17.40"},{"v":0,"d":"$0.00"}]
["Operator Labor & Hand Labor",{"v":0.675,"d":"0.68"},"hours",{"$f":"'Universal Input Prices'!$B$31","v":{"v":12.45,"d":"$12.45"}},{"v":0,"d":"0%"},{"v":8.40375,"d":"$8.40"},{"v":8.40375,"d":"$8.40"},{"v":0,"d":"$0.00"}]
["Diesel Fuel - Tractors",1.91,"gallons",{"$f":"'Universal Input Prices'!$B$32","v":{"v":1.81,"d":"$1.81"}},{"v":0,"d":"0%"},{"v":3.4571,"d":"$3.46"},{"v":3.4571,"d":"$3.46"},{"v":0,"d":"$0.00"}]
["Gasoline - Pickup",{"v":2.0307692,"d":"2.03"},"gallons",{"$f":"'Universal Input Prices'!$B$33","v":{"v":1.926,"d":"$1.93"}},{"v":0,"d":"0%"},{"v":3.9112614792,"d":"$3.91"},{"v":3.9112614792,"d":"$3.91"},{"v":0,"d":"$0.00"}]
["Repair & Maintenance"]
["Implements",{"v":1,"d":"1.00"},"acre",{"v":10.18,"d":"$10.18"},{"v":0,"d":"0%"},{"$f":"D36*B36","v":{"v":10.18,"d":"$10.18"}},{"$f":"F36*(1-E36)","v":{"v":10.18,"d":"$10.18"}},{"$f":"F36*E36","v":{"v":0,"d":"$0.00"}}]
["Tractors",{"v":1,"d":"1.00"},"acre",{"v":3.68,"d":"$3.68"},{"v":0,"d":"0%"},{"$f":"D37*B37","v":{"v":3.68,"d":"$3.68"}},{"$f":"F37*(1-E37)","v":{"v":3.68,"d":"$3.68"}},{"$f":"F37*E37","v":{"v":0,"d":"$0.00"}}]
["Other Fixed Expenses",{"v":1,"d":"1.00"},"acre",{"v":0,"d":"$0.00"},{"v":0,"d":"0%"},{"$f":"D38*B38","v":{"v":0,"d":"$0.00"}},{"$f":"F38*(1-E38)","v":{"v":0,"d":"$0.00"}},{"$f":"F38*E38","v":{"v":0,"d":"$0.00"}}]
["Self Propelled Equipment",{"v":1,"d":"1.00"},"acre",{"v":0,"d":"$0.00"},{"v":0,"d":"0%"},{"$f":"D39*B39","v":{"v":0,"d":"$0.00"}},{"$f":"F39*(1-E39)","v":{"v":0,"d":"$0.00"}},{"$f":"F39*E39","v":{"v":0,"d":"$0.00"}}]
["Pickup",{"v":1,"d":"1.00"},"acre",{"v":2.49,"d":"$2.49"},{"v":0,"d":"0%"},{"$f":"D40*B40","v":{"v":2.49,"d":"$2.49"}},{"$f":"F40*(1-E40)","v":{"v":2.49,"d":"$2.49"}},{"$f":"F40*E40","v":{"v":0,"d":"$0.00"}}]
["Interest-operating capital",{"$f":"'Universal Input Prices'!$B$35","v":{"v":0.054,"d":"5.40%"}},{"$nulls":3},{"$f":"(SUM(F15:F23,F26:F40))*$B41/2.8","v":{"v":2.371190364241714,"d":"$2.37"}},{"$f":"(SUM(G15:G23,G26:G40))*$B41/2","v":{"v":3.1325565099383996,"d":"$3.13"}},{"$f":"(SUM(H15:H23,H26:H40))*$B41/2","v":{"v":0.18711000000000003,"d":"$0.19"}}]
[]
["Total Variable Costs",{"$nulls":4},{"$f":"SUM(F15:F41)","v":{"v":156.57180184344173,"d":"$156.57"}},{"$f":"SUM(G15:G41)","v":{"v":150.4031679891384,"d":"$150.40"}},{"$f":"SUM(H15:H41)","v":{"v":7.11711,"d":"$7.12"}}]
["Returns Above Variable Costs",{"$nulls":4},{"$f":"F12-F43","v":{"v":-12.821801843441733,"d":"($12.82)"}},{"$f":"G12-G43","v":{"v":-6.65316798913841,"d":"($6.65)"}},{"$f":"H12-H43","v":{"v":-7.11711,"d":"($7.12)"}}]
[]
["Fixed Costs"]
["Implements",{"v":1,"d":"1.00"},"acre",{"v":16.35,"d":"$16.35"},{"v":0,"d":"0%"},{"$f":"D47*B47","v":{"v":16.35,"d":"$16.35"}},{"$f":"F47*(1-E47)","v":{"v":16.35,"d":"$16.35"}},{"$f":"F47*E47","v":{"v":0,"d":"$0.00"}}]
["Tractors",{"v":1,"d":"1.00"},"acre",{"v":5.15,"d":"$5.15"},{"v":0,"d":"0%"},{"v":5.15,"d":"$5.15"},{"v":5.15,"d":"$5.15"},{"v":0,"d":"$0.00"}]
["Other Fixed Expenses",{"v":1,"d":"1.00"},"acre",{"v":0,"d":"$0.00"},{"v":0,"d":"0%"},{"v":0,"d":"$0.00"},{"v":0,"d":"$0.00"},{"v":0,"d":"$0.00"}]
["Self Propelled Equipment",{"v":1,"d":"1.00"},"acre",{"v":0,"d":"$0.00"},{"v":0,"d":"0%"},{"v":0,"d":"$0.00"},{"v":0,"d":"$0.00"},{"v":0,"d":"$0.00"}]
["Pickup",{"v":1,"d":"1.00"},"acre",{"v":3.63,"d":"$3.63"},{"v":0,"d":"0%"},{"v":3.63,"d":"$3.63"},{"v":3.63,"d":"$3.63"},{"v":0,"d":"$0.00"}]
["Management",{"v":1,"d":"1.00"},"acre",{"v":0,"d":"$0.00"},{"v":0,"d":"0%"},{"v":0,"d":"$0.00"},{"v":0,"d":"$0.00"},{"v":0,"d":"$0.00"}]
["Whole Farm Insurance",{"v":1,"d":"1.00"},"acre",{"v":0,"d":"$0.00"},{"v":0,"d":"0%"},{"$f":"B53*D53","v":{"v":0,"d":"$0.00"}},{"v":0,"d":"$0.00"},{"v":0,"d":"$0.00"}]
["Land",{"v":1,"d":"1.00"},"acre",{"v":26.5,"d":"$26.50"},{"v":0,"d":"0%"},{"$f":"D54*B54","v":{"v":26.5,"d":"$26.50"}},{"$f":"IF($H$6=\"Cash\",D54,F54*(1-E54))","v":{"v":26.5,"d":"$26.50"}},{"$f":"IF($H$6=\"Cash\",0,F54*E54)","v":{"v":0,"d":"$0.00"}}]
["Property Tax",{"v":1,"d":"1.00"},"acre",{"v":0,"d":"$0.00"},{"v":0,"d":"0%"},{"$f":"B55*D55","v":{"v":0,"d":"$0.00"}},{"v":0,"d":"$0.00"},{"v":0,"d":"$0.00"}]
["Total Fixed Expenses",{"$nulls":4},{"$f":"SUM(F47:F55)","v":{"v":51.629999999999995,"d":"$51.63"}},{"$f":"SUM(G47:G55)","v":{"v":51.629999999999995,"d":"$51.63"}},{"$f":"SUM(H47:H55)","v":{"v":0,"d":"$0.00"}}]
["Total Specified Expenses",{"$nulls":4},{"$f":"F43+F56","v":{"v":208.20180184344173,"d":"$208.20"}},{"$f":"G43+G56","v":{"v":202.0331679891384,"d":"$202.03"}},{"$f":"H43+H56","v":{"v":7.11711,"d":"$7.12"}}]
["Returns Above Total Specified Expenses",{"$nulls":4},{"$f":"F12-F57","v":{"v":-64.45180184344173,"d":"($64.45)"}},{"$f":"G12-G57","v":{"v":-58.283167989138406,"d":"($58.28)"}},{"$f":"H12-H57","v":{"v":-7.11711,"d":"($7.12)"}}]
[]
["Return on Investment",{"$nulls":4},{"$f":"(F58/F57)","v":{"v":-0.3095640924947736,"d":"-30.96%"}},{"$f":"(G58/G57)","v":{"v":-0.28848316625056236,"d":"-28.85%"}},{"v":-1,"d":"-100.00%"}]

{"sheet":"Dry Sorghum Sudangrass","index":22,"n_rows":59,"n_cols":9,"rows_kept":59,"merged":[[1,0,1,7],[2,0,2,7],[3,0,3,7]]}
[]
[" Estimated Costs and Returns per Acre"]
["Dryland Sorghum Sudangrass"]
["Projected for 2016"]
[{"$nulls":7},"Rental Agreement","Share"]
["Item ","Quantity","Unit","Price","Landlord"," ",null,"Share","Cash"]
[{"$nulls":4},"Share","Total","Tenant","Landlord"]
["Income"]
["grazing",{"v":336,"d":"336.00"},"lb",{"$f":"Grazing_Price","v":{"v":0.4,"d":"$0.400"}},{"v":0.33,"d":"33%"},{"$f":"D9*B9","v":{"v":134.4,"d":"$134.40"}},{"$f":"F9*(1-E9)","v":{"v":90.04799999999999,"d":"$90.05"}},{"$f":"IF(H6=\"Cash\", 0,F9*E9)","v":{"v":44.352000000000004,"d":"$44.35"}}]
["other income",{"v":0,"d":"0.00"},"$/ac.",{"v":1,"d":"$1.00"},{"v":0.33,"d":"33%"},{"$f":"D10*B10","v":{"v":0,"d":"$0.00"}},{"$f":"F10*(1-E10)","v":{"v":0,"d":"$0.00"}},{"$f":"IF(H7=\"Cash\", D58,F10*E10)","v":{"v":0,"d":"$0.00"}}]
[]
["Total Income",{"$nulls":4},{"$f":"SUM(F9:F11)","v":{"v":134.4,"d":"$134.40"}},{"$f":"SUM(G9:G11)","v":{"v":90.04799999999999,"d":"$90.05"}},{"$f":"SUM(H9:H11)","v":{"v":44.352000000000004,"d":"$44.35"}}]
[]
["Variable Costs"]
["Seed",{"v":15,"d":"15.00"},"bu",{"v":0.95,"d":"$0.95"},{"v":0,"d":"0%"},{"$f":"D15*B15","v":{"v":14.25,"d":"$14.25"}},{"$f":"F15*(1-E15)","v":{"v":14.25,"d":"$14.25"}},{"$f":"F15*E15","v":{"v":0,"d":"$0.00"}}]
["Fertilizer"]
["fert (N) - NH3 ",{"v":50,"d":"50.0"},"lb",{"$f":"IF(A17=\"\",0,VLOOKUP(A17,'Universal Input Prices'!$A$26:$B$30, 2))","v":{"v":0.25000000000000006,"d":"$0.250"}},{"v":0.33,"d":"33%"},{"$f":"D17*B17","v":{"v":12.500000000000004,"d":"$12.50"}},{"$f":"F17*(1-E17)","v":{"v":8.375000000000002,"d":"$8.38"}},{"$f":"F17*E17","v":{"v":4.125000000000002,"d":"$4.13"}}]
[null,{"v":0,"d":"0.0"},"lb",{"$f":"IF(A18=\"\",0,VLOOKUP(A18,'Universal Input Prices'!$A$26:$B$30, 2))","v":{"v":0,"d":"$0.000"}},{"v":0,"d":"0%"},{"$f":"D18*B18","v":{"v":0,"d":"$0.00"}},{"$f":"F18*(1-E18)","v":{"v":0,"d":"$0.00"}},{"$f":"F18*E18","v":{"v":0,"d":"$0.00"}}]
[null,{"v":0,"d":"0.0"},"lb",{"$f":"IF(A19=\"\",0,VLOOKUP(A19,'Universal Input Prices'!$A$26:$B$30, 2))","v":{"v":0,"d":"$0.000"}},{"v":0,"d":"0%"},{"$f":"D19*B19","v":{"v":0,"d":"$0.00"}},{"$f":"F19*(1-E19)","v":{"v":0,"d":"$0.00"}},{"$f":"F19*E19","v":{"v":0,"d":"$0.00"}}]
["Field Operations"]
["herbicide & application",{"v":1,"d":"1.0"},"lb",{"v":12.1,"d":"$12.10"},{"v":0.33,"d":"33%"},{"$f":"D21*B21","v":{"v":12.1,"d":"$12.10"}},{"$f":"F21*(1-E21)","v":{"v":8.107,"d":"$8.11"}},{"$f":"F21*E21","v":{"v":3.993,"d":"$3.99"}}]
["fertilizer application",{"v":1,"d":"1.0"},"acre",{"v":15,"d":"$15.00"},{"v":0.33,"d":"33%"},{"v":15,"d":"$15.00"},{"v":10.049999999999999,"d":"$10.05"},{"v":4.95,"d":"$4.95"}]
["insecticide & application",{"v":1,"d":"1.0"},"acre",{"v":0,"d":"$0.00"},{"v":0.33,"d":"33%"},{"v":0,"d":"$0.00"},{"v":0,"d":"$0.00"},{"v":0,"d":"$0.00"}]
["custom harvest and haul",{"v":0,"d":"0.0"},"bu",{"v":0,"d":"$0.00"},{"v":0,"d":"0%"},{"v":0,"d":"$0.00"},{"v":0,"d":"$0.00"},{"v":0,"d":"$0.00"}]
["hoeing",{"v":0,"d":"0.0"},"acre",{"v":0,"d":"$0.00"},{"v":0,"d":"0%"},{"v":0,"d":"$0.00"},{"v":0,"d":"$0.00"},{"v":0,"d":"$0.00"}]
["scouting",{"v":1,"d":"1.0"},"acre",{"v":0,"d":"$0.00"},{"v":0,"d":"0%"},{"$f":"D26*B26","v":{"v":0,"d":"$0.00"}},{"$f":"F26*(1-E26)","v":{"v":0,"d":"$0.00"}},{"$f":"F26*E26","v":{"v":0,"d":"$0.00"}}]
["other ",{"v":1,"d":"1.0"},"acre",{"v":0,"d":"$0.00"},{"v":0,"d":"0%"},{"v":0,"d":"$0.00"},{"v":0,"d":"$0.00"},{"v":0,"d":"$0.00"}]
["other ",{"v":1,"d":"1.0"},"acre",{"v":0,"d":"$0.00"},{"v":0,"d":"0%"},{"v":0,"d":"$0.00"},{"v":0,"d":"$0.00"},{"v":0,"d":"$0.00"}]
["other ",{"v":1,"d":"1.0"},"acre",{"v":0,"d":"$0.00"},{"v":0,"d":"0%"},{"v":0,"d":"$0.00"},{"v":0,"d":"$0.00"},{"v":0,"d":"$0.00"}]
["Crop Insurance",{"v":1,"d":"1.0"},"acre",{"v":19,"d":"$19.00"},{"v":0.33,"d":"33%"},{"v":19,"d":"$19.00"},{"v":12.729999999999999,"d":"$12.73"},{"v":6.2700000000000005,"d":"$6.27"}]
["Operator Labor & Hand Labor",{"v":0.905,"d":"0.91"},"hours",{"$f":"'Universal Input Prices'!$B$31","v":{"v":12.45,"d":"$12.45"}},{"v":0,"d":"0%"},{"v":11.267249999999999,"d":"$11.27"},{"v":11.267249999999999,"d":"$11.27"},{"v":0,"d":"$0.00"}]
["Diesel Fuel - Tractors",2.15,"gallons",{"$f":"'Universal Input Prices'!$B$32","v":{"v":1.81,"d":"$1.81"}},{"v":0,"d":"0%"},{"v":3.8914999999999997,"d":"$3.89"},{"v":3.8914999999999997,"d":"$3.89"},{"v":0,"d":"$0.00"}]
["Gasoline - Pickup",{"v":2.030769,"d":"2.03"},"gallons",{"$f":"'Universal Input Prices'!$B$33","v":{"v":1.926,"d":"$1.93"}},{"v":0,"d":"0%"},{"v":3.9112610939999994,"d":"$3.91"},{"v":3.9112610939999994,"d":"$3.91"},{"v":0,"d":"$0.00"}]
["Repair & Maintenance"]
["Implements",{"v":1,"d":"1.00"},"acre",{"v":9.72,"d":"$9.72"},{"v":0,"d":"0%"},{"$f":"D35*B35","v":{"v":9.72,"d":"$9.72"}},{"v":9.72,"d":"$9.72"},{"v":0,"d":"$0.00"}]
["Tractors",{"v":1,"d":"1.00"},"acre",{"v":3.57,"d":"$3.57"},{"v":0,"d":"0%"},{"$f":"D36*B36","v":{"v":3.57,"d":"$3.57"}},{"v":3.57,"d":"$3.57"},{"v":0,"d":"$0.00"}]
["Other Fixed Expenses",{"v":15,"d":"15.00"},"acre",{"v":0,"d":"$0.00"},{"v":0,"d":"0%"},{"$f":"D37*B37","v":{"v":0,"d":"$0.00"}},{"v":0,"d":"$0.00"},{"v":0,"d":"$0.00"}]
["Self Propelled Equipment",{"v":1,"d":"1.00"},"acre",{"v":0,"d":"$0.00"},{"v":1,"d":"100%"},{"$f":"D38*B38","v":{"v":0,"d":"$0.00"}},{"v":0,"d":"$0.00"},{"v":0,"d":"$0.00"}]
["Pickup",{"v":1,"d":"1.00"},"acre",{"v":2.49,"d":"$2.49"},{"v":0,"d":"0%"},{"$f":"D39*B39","v":{"v":2.49,"d":"$2.49"}},{"v":2.49,"d":"$2.49"},{"v":0,"d":"$0.00"}]
["Interest-operating capital",{"$f":"'Universal Input Prices'!$B$35","v":{"v":0.054,"d":"5.40%"}},{"$nulls":3},{"$f":"(SUM(F15:F23,F25:F39))*$B40/2.65","v":{"v":2.194641735500377,"d":"$2.19"}},{"$f":"(SUM(G15:G23,G25:G39))*$B40/2","v":{"v":2.385774299537999,"d":"$2.39"}},{"$f":"(SUM(H15:H23,H25:H39))*$B40/2","v":{"v":0.522126,"d":"$0.52"}}]
[]
["Total Variable Costs",{"$nulls":4},{"$f":"SUM(F15:F40)","v":{"v":109.89465282950036,"d":"$109.89"}},{"$f":"SUM(G15:G40)","v":{"v":90.74778539353797,"d":"$90.75"}},{"$f":"SUM(H15:H40)","v":{"v":19.860126,"d":"$19.86"}}]
["Returns Above Variable Costs",{"$nulls":4},{"$f":"F12-F42","v":{"v":24.505347170499647,"d":"$24.51"}},{"$f":"G12-G42","v":{"v":-0.6997853935379794,"d":"($0.70)"}},{"$f":"H12-H42","v":{"v":24.491874000000003,"d":"$24.49"}}]
[]
["Fixed Costs"]
["Implements",{"v":1,"d":"1.00"},"acre",{"v":15.22,"d":"$15.22"},{"v":0,"d":"0%"},{"$f":"D46*B46","v":{"v":15.22,"d":"$15.22"}},{"$f":"F46*(1-E46)","v":{"v":15.22,"d":"$15.22"}},{"$f":"F46*E46","v":{"v":0,"d":"$0.00"}}]
["Tractors",{"v":1,"d":"1.00"},"acre",{"v":5.08,"d":"$5.08"},{"v":0,"d":"0%"},{"v":5.08,"d":"$5.08"},{"v":5.08,"d":"$5.08"},{"v":0,"d":"$0.00"}]
["Other Fixed Expenses",{"v":1,"d":"1.00"},"acre",{"v":0,"d":"$0.00"},{"v":1,"d":"100%"},{"v":0,"d":"$0.00"},{"v":0,"d":"$0.00"},{"v":0,"d":"$0.00"}]
["Self Propelled Equipment",{"v":1,"d":"1.00"},"acre",{"v":0,"d":"$0.00"},{"v":1,"d":"100%"},{"v":0,"d":"$0.00"},{"v":0,"d":"$0.00"},{"v":0,"d":"$0.00"}]
["Pickup",{"v":1,"d":"1.00"},"acre",{"v":3.63,"d":"$3.63"},{"v":0,"d":"0%"},{"v":3.63,"d":"$3.63"},{"v":3.63,"d":"$3.63"},{"v":0,"d":"$0.00"}]
["Management",{"v":1,"d":"1.00"},"acre",{"v":0,"d":"$0.00"},{"v":0,"d":"0%"},{"v":0,"d":"$0.00"},{"v":0,"d":"$0.00"},{"v":0,"d":"$0.00"}]
["Whole Farm Insurance",{"v":1,"d":"1.00"},"acre",{"v":0,"d":"$0.00"},{"v":0,"d":"0%"},{"$f":"B52*D52","v":{"v":0,"d":"$0.00"}},{"v":0,"d":"$0.00"},{"v":0,"d":"$0.00"}]
["Land",{"v":1,"d":"1.00"},"acre",{"v":26.5,"d":"$26.50"},{"v":1,"d":"100%"},{"$f":"D53*B53","v":{"v":26.5,"d":"$26.50"}},{"$f":"IF($H$6=\"Cash\",D53,F53*(1-E53))","v":{"v":0,"d":"$0.00"}},{"$f":"IF($H$6=\"Cash\",0,F53*E53)","v":{"v":26.5,"d":"$26.50"}}]
["Property Tax",{"v":1,"d":"1.00"},"acre",{"v":0,"d":"$0.00"},{"v":1,"d":"100%"},{"$f":"B54*D54","v":{"v":0,"d":"$0.00"}},{"v":0,"d":"$0.00"},{"v":0,"d":"$0.00"}]
["Total Fixed Expenses",{"$nulls":4},{"$f":"SUM(F46:F54)","v":{"v":50.43,"d":"$50.43"}},{"$f":"SUM(G46:G54)","v":{"v":23.93,"d":"$23.93"}},{"$f":"SUM(H46:H54)","v":{"v":26.5,"d":"$26.50"}}]
["Total Specified Expenses",{"$nulls":4},{"$f":"F42+F55","v":{"v":160.32465282950037,"d":"$160.32"}},{"$f":"G42+G55","v":{"v":114.67778539353796,"d":"$114.68"}},{"$f":"H42+H55","v":{"v":46.360126,"d":"$46.36"}}]
["Returns Above Total Specified Expenses",{"$nulls":4},{"$f":"F12-F56","v":{"v":-25.92465282950036,"d":"($25.92)"}},{"$f":"G12-G56","v":{"v":-24.629785393537972,"d":"($24.63)"}},{"$f":"H12-H56","v":{"v":-2.008125999999997,"d":"($2.01)"}}]
[]
["Return on Investment",{"$nulls":4},{"$f":"(F57/F56)","v":{"v":-0.16170097593830637,"d":"-16.17%"}},{"$f":"(G57/G56)","v":{"v":-0.21477381437927426,"d":"-21.48%"}},{"v":-0.04331580116930651,"d":"-4.33%"}]

{"sheet":"Dry Sunflowers-Oilseed","index":23,"n_rows":61,"n_cols":9,"rows_kept":61,"merged":[[1,0,1,7],[2,0,2,7],[3,0,3,7]]}
[]
[" Estimated Costs and Returns per Acre"]
["Dryland Sunflowers-Oilseed "]
["Projected for 2016"]
[{"$nulls":7},"Rental Agreement","Share"]
["Item ","Quantity","Unit","Price","Landlord"," ",null,"Share","Cash"]
[{"$nulls":4},"Share","Total","Tenant","Landlord"]
["Income"]
["oilseed sunflowers",{"v":10,"d":"10.00"},"cwt",{"$f":"'Universal Input Prices'!$B$16","v":{"v":16.5,"d":"$16.50"}},{"v":0.33,"d":"33%"},{"$f":"D9*B9","v":{"v":165,"d":"$165.00"}},{"$f":"F9*(1-E9)","v":{"v":110.54999999999998,"d":"$110.55"}},{"$f":"IF(H6=\"Cash\", D55,F9*E9)","v":{"v":54.45,"d":"$54.45"}}]
["other income",{"v":0,"d":"0.00"},"$/ac.",{"v":1,"d":"$1.00"},{"v":0.33,"d":"33%"},{"$f":"D10*B10","v":{"v":0,"d":"$0.00"}},{"$f":"F10*(1-E10)","v":{"v":0,"d":"$0.00"}},{"$f":"IF(H7=\"Cash\", D58,F10*E10)","v":{"v":0,"d":"$0.00"}}]
[]
["Total Income",{"$nulls":4},{"$f":"SUM(F8:F11)","v":{"v":165,"d":"$165.00"}},{"$f":"SUM(G8:G11)","v":{"v":110.54999999999998,"d":"$110.55"}},{"$f":"SUM(H8:H11)","v":{"v":54.45,"d":"$54.45"}}]
[]
["Variable Costs"]
["Seed",{"v":1,"d":"1.00"},"acre",{"v":11,"d":"$11.00"},{"v":0,"d":"0%"},{"$f":"D15*B15","v":{"v":11,"d":"$11.00"}},{"$f":"F15*(1-E15)","v":{"v":11,"d":"$11.00"}},{"$f":"F15*E15","v":{"v":0,"d":"$0.00"}}]
["Fertilizer"]
["fert (N) - liquid",{"v":40,"d":"40.0"},"lb",{"$f":"IF(A17=\"\",0,VLOOKUP(A17,'Universal Input Prices'!$A$26:$B$27, 2))","v":{"v":0.41015625,"d":"$0.410"}},{"v":0.33,"d":"33%"},{"$f":"D17*B17","v":{"v":16.40625,"d":"$16.41"}},{"$f":"F17*(1-E17)","v":{"v":10.992187499999998,"d":"$10.99"}},{"$f":"F17*E17","v":{"v":5.4140625,"d":"$5.41"}}]
[null,{"v":0,"d":"0.0"},"lb",{"$f":"IF(A18=\"\",0,VLOOKUP(A18,'Universal Input Prices'!$A$26:$B$30, 2))","v":{"v":0,"d":"$0.000"}},{"v":0,"d":"0%"},{"$f":"D18*B18","v":{"v":0,"d":"$0.00"}},{"$f":"F18*(1-E18)","v":{"v":0,"d":"$0.00"}},{"$f":"F18*E18","v":{"v":0,"d":"$0.00"}}]
[null,{"v":0,"d":"0.0"},"lb",{"$f":"IF(A19=\"\",0,VLOOKUP(A19,'Universal Input Prices'!$A$26:$B$30, 2))","v":{"v":0,"d":"$0.000"}},{"v":0,"d":"0%"},{"$f":"D19*B19","v":{"v":0,"d":"$0.00"}},{"$f":"F19*(1-E19)","v":{"v":0,"d":"$0.00"}},{"$f":"F19*E19","v":{"v":0,"d":"$0.00"}}]
["Field Operations"]
["herbicide & application (glyphosphate)",{"v":3,"d":"3.0"},"acre",{"v":9.4,"d":"$9.40"},{"v":0.33,"d":"33%"},{"$f":"D21*B21","v":{"v":28.200000000000003,"d":"$28.20"}},{"$f":"F21*(1-E21)","v":{"v":18.894,"d":"$18.89"}},{"$f":"F21*E21","v":{"v":9.306000000000001,"d":"$9.31"}}]
["herbicide & application (2-4D/Prowl H2O)",{"v":1,"d":"1.0"},"acre",{"v":15.35,"d":"$15.35"},{"v":0.33,"d":"33%"},{"$f":"D22*B22","v":{"v":15.35,"d":"$15.35"}},{"$f":"F22*(1-E22)","v":{"v":10.2845,"d":"$10.28"}},{"$f":"F22*E22","v":{"v":5.0655,"d":"$5.07"}}]
["seed insecticide & application",{"v":1,"d":"1.0"},"acre",{"v":8.75,"d":"$8.75"},{"v":0.33,"d":"33%"},{"v":8.75,"d":"$8.75"},{"v":5.862499999999999,"d":"$5.86"},{"v":2.8875,"d":"$2.89"}]
["custom harvest",{"v":1,"d":"1.0"},"acre",{"v":25,"d":"$25.00"},{"v":0,"d":"0%"},{"v":25,"d":"$25.00"},{"v":25,"d":"$25.00"},{"v":0,"d":"$0.00"}]
["custom haul",{"$f":"B9","v":{"v":10,"d":"10.00"}},"cwt",{"v":0.45,"d":"$0.45"},{"v":0,"d":"0%"},{"v":4.5,"d":"$4.50"},{"v":4.5,"d":"$4.50"},{"v":0,"d":"$0.00"}]
["pesticide & application (ammo)",{"v":1,"d":"1.0"},"acre",{"v":3.25,"d":"$3.25"},{"v":0,"d":"0%"},{"$f":"D26*B26","v":{"v":3.25,"d":"$3.25"}},{"$f":"F26*(1-E26)","v":{"v":3.25,"d":"$3.25"}},{"$f":"F26*E26","v":{"v":0,"d":"$0.00"}}]
["other ",{"v":1,"d":"1.0"},"acre",{"v":0,"d":"$0.00"},{"v":0,"d":"0%"},{"$f":"D27*B27","v":{"v":0,"d":"$0.00"}},{"$f":"F27*(1-E27)","v":{"v":0,"d":"$0.00"}},{"$f":"F27*E27","v":{"v":0,"d":"$0.00"}}]
["other ",{"v":1,"d":"1.0"},"acre",{"v":0,"d":"$0.00"},{"v":0,"d":"0%"},{"$f":"D28*B28","v":{"v":0,"d":"$0.00"}},{"$f":"F28*(1-E28)","v":{"v":0,"d":"$0.00"}},{"$f":"F28*E28","v":{"v":0,"d":"$0.00"}}]
["other ",{"v":1,"d":"1.0"},"acre",{"v":0,"d":"$0.00"},{"v":0,"d":"0%"},{"v":0,"d":"$0.00"},{"v":0,"d":"$0.00"},{"v":0,"d":"$0.00"}]
["other ",{"v":1,"d":"1.0"},"acre",{"v":0,"d":"$0.00"},{"v":0,"d":"0%"},{"v":0,"d":"$0.00"},{"v":0,"d":"$0.00"},{"v":0,"d":"$0.00"}]
["other ",{"v":1,"d":"1.0"},"acre",{"v":0,"d":"$0.00"},{"v":0,"d":"0%"},{"v":0,"d":"$0.00"},{"v":0,"d":"$0.00"},{"v":0,"d":"$0.00"}]
["Crop Insurance",{"v":1,"d":"1.0"},"acre",{"v":10,"d":"$10.00"},{"v":0.33,"d":"33%"},{"v":10,"d":"$10.00"},{"v":6.699999999999999,"d":"$6.70"},{"v":3.3000000000000003,"d":"$3.30"}]
["Operator Labor & Hand Labor",{"v":0.455,"d":"0.46"},"hours",{"$f":"'Universal Input Prices'!$B$31","v":{"v":12.45,"d":"$12.45"}},{"v":0,"d":"0%"},{"v":5.66475,"d":"$5.66"},{"v":5.66475,"d":"$5.66"},{"v":0,"d":"$0.00"}]
["Diesel Fuel - Tractors",1.57,"gallons",{"$f":"'Universal Input Prices'!$B$32","v":{"v":1.81,"d":"$1.81"}},{"v":0,"d":"0%"},{"v":2.8417000000000003,"d":"$2.84"},{"v":2.8417000000000003,"d":"$2.84"},{"v":0,"d":"$0.00"}]
["Gasoline - Pickup",{"v":2.030769,"d":"2.03"},"gallons",{"$f":"'Universal Input Prices'!$B$33","v":{"v":1.926,"d":"$1.93"}},{"v":0,"d":"0%"},{"v":3.9112610939999994,"d":"$3.91"},{"v":3.9112610939999994,"d":"$3.91"},{"v":0,"d":"$0.00"}]
["Repair & Maintenance"]
["Implements",{"v":1,"d":"1.00"},"acre",{"v":8.82,"d":"$8.82"},{"v":0,"d":"0%"},{"$f":"D37*B37","v":{"v":8.82,"d":"$8.82"}},{"$f":"F37*(1-E37)","v":{"v":8.82,"d":"$8.82"}},{"$f":"F37*E37","v":{"v":0,"d":"$0.00"}}]
["Tractors",{"v":1,"d":"1.00"},"acre",{"v":3.28,"d":"$3.28"},{"v":0,"d":"0%"},{"$f":"D38*B38","v":{"v":3.28,"d":"$3.28"}},{"$f":"F38*(1-E38)","v":{"v":3.28,"d":"$3.28"}},{"$f":"F38*E38","v":{"v":0,"d":"$0.00"}}]
["Other Fixed Expenses",{"v":1,"d":"1.00"},"acre",{"v":0,"d":"$0.00"},{"v":0,"d":"0%"},{"v":0,"d":"$0.00"},{"$f":"F39*(1-E39)","v":{"v":0,"d":"$0.00"}},{"$f":"F39*E39","v":{"v":0,"d":"$0.00"}}]
["Self Propelled Equipment",{"v":1,"d":"1.00"},"acre",{"v":0,"d":"$0.00"},{"v":1,"d":"100%"},{"$f":"D40*B40","v":{"v":0,"d":"$0.00"}},{"$f":"F40*(1-E40)","v":{"v":0,"d":"$0.00"}},{"$f":"F40*E40","v":{"v":0,"d":"$0.00"}}]
["Pickup",{"v":1,"d":"1.00"},"acre",{"v":2.49,"d":"$2.49"},{"v":0,"d":"0%"},{"$f":"D41*B41","v":{"v":2.49,"d":"$2.49"}},{"$f":"F41*(1-E41)","v":{"v":2.49,"d":"$2.49"}},{"$f":"F41*E41","v":{"v":0,"d":"$0.00"}}]
["Interest-operating capital",{"$f":"'Universal Input Prices'!$B$35","v":{"v":0.054,"d":"5.40%"}},{"$nulls":3},{"$f":"(SUM(F15:F23,F26:F41))*$B42/2.4","v":{"v":2.6991891246149997,"d":"$2.70"}},{"$f":"(SUM(G15:G23,G26:G41))*$B42/2","v":{"v":2.537754262038,"d":"$2.54"}},{"$f":"(SUM(H15:H23,H26:H41))*$B42/2","v":{"v":0.7012726875,"d":"$0.70"}}]
[]
["Total Variable Costs",{"$nulls":4},{"$f":"SUM(F15:F42)","v":{"v":152.16315021861502,"d":"$152.16"}},{"$f":"SUM(G15:G42)","v":{"v":126.02865285603801,"d":"$126.03"}},{"$f":"SUM(H15:H42)","v":{"v":26.674335187500002,"d":"$26.67"}}]
["Returns Above Variable Costs",{"$nulls":4},{"$f":"F12-F44","v":{"v":12.836849781384984,"d":"$12.84"}},{"$f":"G12-G44","v":{"v":-15.478652856038025,"d":"($15.48)"}},{"$f":"H12-H44","v":{"v":27.7756648125,"d":"$27.78"}}]
[]
["Fixed Costs"]
["Implements",{"v":1,"d":"1.00"},"acre",{"v":14.08,"d":"$14.08"},{"v":0,"d":"0%"},{"$f":"D48*B48","v":{"v":14.08,"d":"$14.08"}},{"$f":"F48*(1-E48)","v":{"v":14.08,"d":"$14.08"}},{"$f":"F48*E48","v":{"v":0,"d":"$0.00"}}]
["Tractors",{"v":1,"d":"1.00"},"acre",{"v":4.88,"d":"$4.88"},{"v":0,"d":"0%"},{"v":4.88,"d":"$4.88"},{"v":4.88,"d":"$4.88"},{"v":0,"d":"$0.00"}]
["Other Fixed Expenses",{"v":1,"d":"1.00"},"acre",{"v":0,"d":"$0.00"},{"v":1,"d":"100%"},{"v":0,"d":"$0.00"},{"v":0,"d":"$0.00"},{"v":0,"d":"$0.00"}]
["Self Propelled Equipment",{"v":1,"d":"1.00"},"acre",{"v":0,"d":"$0.00"},{"v":1,"d":"100%"},{"v":0,"d":"$0.00"},{"v":0,"d":"$0.00"},{"v":0,"d":"$0.00"}]
["Pickup",{"v":1,"d":"1.00"},"acre",{"v":3.63,"d":"$3.63"},{"v":0,"d":"0%"},{"v":3.63,"d":"$3.63"},{"v":3.63,"d":"$3.63"},{"v":0,"d":"$0.00"}]
["Management",{"v":1,"d":"1.00"},"acre",{"v":0,"d":"$0.00"},{"v":0,"d":"0%"},{"v":0,"d":"$0.00"},{"v":0,"d":"$0.00"},{"v":0,"d":"$0.00"}]
["Whole Farm Insurance",{"v":1,"d":"1.00"},"acre",{"v":0,"d":"$0.00"},{"v":0,"d":"0%"},{"$f":"B54*D54","v":{"v":0,"d":"$0.00"}},{"v":0,"d":"$0.00"},{"v":0,"d":"$0.00"}]
["Land",{"v":1,"d":"1.00"},"acre",{"v":26.5,"d":"$26.50"},{"v":1,"d":"100%"},{"$f":"D55*B55","v":{"v":26.5,"d":"$26.50"}},{"$f":"IF($H$6=\"Cash\",D55,F55*(1-E55))","v":{"v":0,"d":"$0.00"}},{"$f":"IF($H$6=\"Cash\",0,F55*E55)","v":{"v":26.5,"d":"$26.50"}}]
["Property Tax",{"v":1,"d":"1.00"},"acre",{"v":0,"d":"$0.00"},{"v":1,"d":"100%"},{"$f":"B56*D56","v":{"v":0,"d":"$0.00"}},{"v":0,"d":"$0.00"},{"v":0,"d":"$0.00"}]
["Total Fixed Expenses",{"$nulls":4},{"$f":"SUM(F48:F56)","v":{"v":49.09,"d":"$49.09"}},{"$f":"SUM(G48:G56)","v":{"v":22.59,"d":"$22.59"}},{"$f":"SUM(H48:H56)","v":{"v":26.5,"d":"$26.50"}}]
["Total Specified Expenses",{"$nulls":4},{"$f":"F44+F57","v":{"v":201.25315021861502,"d":"$201.25"}},{"$f":"G44+G57","v":{"v":148.618652856038,"d":"$148.62"}},{"$f":"H44+H57","v":{"v":53.174335187500006,"d":"$53.17"}}]
["Returns Above Total Specified Expenses",{"$nulls":4},{"$f":"F12-F58","v":{"v":-36.25315021861502,"d":"($36.25)"}},{"$f":"G12-G58","v":{"v":-38.06865285603803,"d":"($38.07)"}},{"$f":"H12-H58","v":{"v":1.275664812499997,"d":"$1.28"}}]
[]
["Return on Investment",{"$nulls":4},{"$f":"(F59/F58)","v":{"v":-0.1801370571304566,"d":"-18.01%"}},{"$f":"(G59/G58)","v":{"v":-0.2561498985791096,"d":"-25.61%"}},{"v":0.023990235289295628,"d":"2.40%"}]

{"sheet":"Dry Wheat","index":24,"n_rows":61,"n_cols":9,"rows_kept":61,"merged":[[1,0,1,7],[2,0,2,7],[3,0,3,7]]}
[]
[" Estimated Costs and Returns per Acre"]
["Dryland Wheat"]
["Projected for 2016"]
[{"$nulls":7},"Rental Agreement","Share"]
["Item ","Quantity","Unit","Price","Landlord"," ",null,"Share","Cash"]
[{"$nulls":4},"Share","Total","Tenant","Landlord"]
["Income"]
["wheat",{"v":20,"d":"20.0"},"bu",{"$f":"'Universal Input Prices'!$B$18","v":{"v":3.95,"d":"$3.95"}},{"v":0.33,"d":"33%"},{"$f":"D9*B9","v":{"v":79,"d":"$79.00"}},{"$f":"F9*(1-E9)","v":{"v":52.92999999999999,"d":"$52.93"}},{"$f":"IF(H6=\"Cash\", D55,F9*E9)","v":{"v":26.07,"d":"$26.07"}}]
["grazing",{"v":73,"d":"73.00"},"lb",{"$f":"Grazing_Price","v":{"v":0.4,"d":"$0.400"}},{"v":0.33,"d":"33%"},{"$f":"D10*B10","v":{"v":29.200000000000003,"d":"$29.20"}},{"$f":"F10*(1-E10)","v":{"v":19.564,"d":"$19.56"}},{"$f":"IF(H6=\"Cash\", 0,F10*E10)","v":{"v":9.636000000000001,"d":"$9.64"}}]
["other income",{"v":0,"d":"0.00"},"$/ac.",{"v":1,"d":"$1.00"},{"v":0.33,"d":"33%"},{"$f":"D11*B11","v":{"v":0,"d":"$0.00"}},{"$f":"F11*(1-E11)","v":{"v":0,"d":"$0.00"}},{"$f":"IF(H8=\"Cash\", D59,F11*E11)","v":{"v":0,"d":"$0.00"}}]
[]
["Total Income",{"$nulls":4},{"$f":"SUM(F8:F12)","v":{"v":108.2,"d":"$108.20"}},{"$f":"SUM(G8:G12)","v":{"v":72.494,"d":"$72.49"}},{"v":35.706,"d":"$35.71"}]
[]
["Variable Costs"]
["Seed",{"v":1,"d":"1.00"},"bu",{"v":6,"d":"$6.000"},{"v":0,"d":"0%"},{"$f":"D16*B16","v":{"v":6,"d":"$6.00"}},{"$f":"F16*(1-E16)","v":{"v":6,"d":"$6.00"}},{"$f":"F16*E16","v":{"v":0,"d":"$0.00"}}]
["Fertilizer"]
["fert (N) - NH3 ",{"v":30,"d":"30.0"},"lb",{"$f":"IF(A18=\"\",0,VLOOKUP(A18,'Universal Input Prices'!$A$26:$B$30, 2))","v":{"v":0.25000000000000006,"d":"$0.250"}},{"v":0.33,"d":"33%"},{"$f":"D18*B18","v":{"v":7.500000000000002,"d":"$7.50"}},{"$f":"F18*(1-E18)","v":{"v":5.025,"d":"$5.03"}},{"$f":"F18*E18","v":{"v":2.4750000000000005,"d":"$2.48"}}]
[null,{"v":0,"d":"0.0"},"lb",{"$f":"IF(A19=\"\",0,VLOOKUP(A19,'Universal Input Prices'!$A$26:$B$30, 2))","v":{"v":0,"d":"$0.000"}},{"v":0,"d":"0%"},{"$f":"D19*B19","v":{"v":0,"d":"$0.00"}},{"$f":"F19*(1-E19)","v":{"v":0,"d":"$0.00"}},{"$f":"F19*E19","v":{"v":0,"d":"$0.00"}}]
[null,{"v":0,"d":"0.0"},"lb",{"$f":"IF(A20=\"\",0,VLOOKUP(A20,'Universal Input Prices'!$A$26:$B$30, 2))","v":{"v":0,"d":"$0.000"}},{"v":0,"d":"0%"},{"$f":"D20*B20","v":{"v":0,"d":"$0.00"}},{"$f":"F20*(1-E20)","v":{"v":0,"d":"$0.00"}},{"$f":"F20*E20","v":{"v":0,"d":"$0.00"}}]
["Field Operations"]
["herbicide & application",{"v":1,"d":"1.0"},"acre",{"v":0,"d":"$0.00"},{"v":0.33,"d":"33%"},{"$f":"D22*B22","v":{"v":0,"d":"$0.00"}},{"$f":"F22*(1-E22)","v":{"v":0,"d":"$0.00"}},{"$f":"F22*E22","v":{"v":0,"d":"$0.00"}}]
["fertilizer application",{"v":1,"d":"1.0"},"acre",{"v":15,"d":"$15.00"},{"v":0.33,"d":"33%"},{"v":15,"d":"$15.00"},{"v":10.049999999999999,"d":"$10.05"},{"v":4.95,"d":"$4.95"}]
["insecticide & application",{"v":1,"d":"1.0"},"acre",{"v":0,"d":"$0.00"},{"v":0.33,"d":"33%"},{"v":0,"d":"$0.00"},{"v":0,"d":"$0.00"},{"v":0,"d":"$0.00"}]
["custom harvest & haul",{"v":1,"d":"1.0"},"acre",{"v":25,"d":"$25.00"},{"v":0,"d":"0%"},{"v":25,"d":"$25.00"},{"v":25,"d":"$25.00"},{"v":0,"d":"$0.00"}]
["custom harvest & haul",{"$f":"B9","v":{"v":20,"d":"20.0"}},"bu",{"v":0.25,"d":"$0.25"},{"v":0,"d":"0%"},{"$f":"D26*B26","v":{"v":5,"d":"$5.00"}},{"v":5,"d":"$5.00"},{"v":0,"d":"$0.00"}]
["hoeing",{"v":0,"d":"0.0"},"acre",{"v":0,"d":"$0.00"},{"v":0,"d":"0%"},{"v":0,"d":"$0.00"},{"v":0,"d":"$0.00"},{"v":0,"d":"$0.00"}]
["scouting",{"v":1,"d":"1.0"},"acre",{"v":0,"d":"$0.00"},{"v":0,"d":"0%"},{"$f":"D28*B28","v":{"v":0,"d":"$0.00"}},{"$f":"F28*(1-E28)","v":{"v":0,"d":"$0.00"}},{"$f":"F28*E28","v":{"v":0,"d":"$0.00"}}]
["other ",{"v":1,"d":"1.0"},"acre",{"v":0,"d":"$0.00"},{"v":0,"d":"0%"},{"v":0,"d":"$0.00"},{"v":0,"d":"$0.00"},{"v":0,"d":"$0.00"}]
["other ",{"v":1,"d":"1.0"},"acre",{"v":0,"d":"$0.00"},{"v":0,"d":"0%"},{"v":0,"d":"$0.00"},{"v":0,"d":"$0.00"},{"v":0,"d":"$0.00"}]
["other ",{"v":1,"d":"1.0"},"acre",{"v":0,"d":"$0.00"},{"v":0,"d":"0%"},{"v":0,"d":"$0.00"},{"v":0,"d":"$0.00"},{"v":0,"d":"$0.00"}]
["Crop Insurance",{"v":1,"d":"1.0"},"acre",{"v":15,"d":"$15.00"},{"v":0.33,"d":"33%"},{"v":15,"d":"$15.00"},{"v":10.049999999999999,"d":"$10.05"},{"v":4.95,"d":"$4.95"}]
["Operator Labor & Hand Labor",{"v":0.855,"d":"0.86"},"hours",{"$f":"'Universal Input Prices'!$B$31","v":{"v":12.45,"d":"$12.45"}},{"v":0,"d":"0%"},{"v":10.644749999999998,"d":"$10.64"},{"v":10.644749999999998,"d":"$10.64"},{"v":0,"d":"$0.00"}]
["Diesel Fuel - Tractors",2.22,"gallons",{"$f":"'Universal Input Prices'!$B$32","v":{"v":1.81,"d":"$1.81"}},{"v":0,"d":"0%"},{"v":4.0182,"d":"$4.02"},{"v":4.0182,"d":"$4.02"},{"v":0,"d":"$0.00"}]
["Gasoline - Pickup",2.03,"gallons",{"$f":"'Universal Input Prices'!$B$33","v":{"v":1.926,"d":"$1.93"}},{"v":0,"d":"0%"},{"v":3.9097799999999996,"d":"$3.91"},{"v":3.9097799999999996,"d":"$3.91"},{"v":0,"d":"$0.00"}]
["Repair & Maintenance"]
["Implements",{"v":1,"d":"1.00"},"acre",{"v":10.59,"d":"$10.59"},{"v":0,"d":"0%"},{"$f":"D37*B37","v":{"v":10.59,"d":"$10.59"}},{"$f":"F37*(1-E37)","v":{"v":10.59,"d":"$10.59"}},{"$f":"F37*E37","v":{"v":0,"d":"$0.00"}}]
["Tractors",{"v":1,"d":"1.00"},"acre",{"v":4.18,"d":"$4.18"},{"v":0,"d":"0%"},{"$f":"D38*B38","v":{"v":4.18,"d":"$4.18"}},{"$f":"F38*(1-E38)","v":{"v":4.18,"d":"$4.18"}},{"$f":"F38*E38","v":{"v":0,"d":"$0.00"}}]
["Other Fixed Expenses",{"v":1,"d":"1.00"},"acre",{"v":0,"d":"$0.00"},{"v":0,"d":"0%"},{"v":0,"d":"$0.00"},{"$f":"F39*(1-E39)","v":{"v":0,"d":"$0.00"}},{"$f":"F39*E39","v":{"v":0,"d":"$0.00"}}]
["Self Propelled Equipment",{"v":1,"d":"1.00"},"acre",{"v":0,"d":"$0.00"},{"v":1,"d":"100%"},{"$f":"D40*B40","v":{"v":0,"d":"$0.00"}},{"$f":"F40*(1-E40)","v":{"v":0,"d":"$0.00"}},{"$f":"F40*E40","v":{"v":0,"d":"$0.00"}}]
["Pickup",{"v":1,"d":"1.00"},"acre",{"v":2.49,"d":"$2.49"},{"v":0,"d":"0%"},{"$f":"D41*B41","v":{"v":2.49,"d":"$2.49"}},{"$f":"F41*(1-E41)","v":{"v":2.49,"d":"$2.49"}},{"$f":"F41*E41","v":{"v":0,"d":"$0.00"}}]
["Interest-operating capital",{"$f":"'Universal Input Prices'!$B$35","v":{"v":0.054,"d":"5.40%"}},{"$nulls":3},{"$f":"(SUM(F16:F24,F27:F41))*$B42/1.7","v":{"v":2.519980835294117,"d":"$2.52"}},{"$f":"(SUM(G16:G24,G27:G41))*$B42/2","v":{"v":1.8078587099999996,"d":"$1.81"}},{"$f":"(SUM(H16:H24,H27:H41))*$B42/2","v":{"v":0.334125,"d":"$0.33"}}]
[]
["Total Variable Costs",{"$nulls":4},{"$f":"SUM(F16:F42)","v":{"v":111.8527108352941,"d":"$111.85"}},{"$f":"SUM(G16:G42)","v":{"v":98.76558870999999,"d":"$98.77"}},{"$f":"SUM(H16:H42)","v":{"v":12.709125,"d":"$12.71"}}]
["Returns Above Variable Costs",{"$nulls":4},{"$f":"F13-F44","v":{"v":-3.6527108352941013,"d":"($3.65)"}},{"$f":"G13-G44","v":{"v":-26.27158870999999,"d":"($26.27)"}},{"$f":"H13-H44","v":{"v":22.996875000000003,"d":"$23.00"}}]
[]
["Fixed Costs"]
["Implements",{"v":1,"d":"1.00"},"acre",{"v":17.06,"d":"$17.06"},{"v":0,"d":"0%"},{"$f":"D48*B48","v":{"v":17.06,"d":"$17.06"}},{"$f":"F48*(1-E48)","v":{"v":17.06,"d":"$17.06"}},{"$f":"F48*E48","v":{"v":0,"d":"$0.00"}}]
["Tractors",{"v":1,"d":"1.00"},"acre",{"v":5.99,"d":"$5.99"},{"v":0,"d":"0%"},{"v":5.99,"d":"$5.99"},{"v":5.99,"d":"$5.99"},{"v":0,"d":"$0.00"}]
["Other Fixed Expenses",{"v":1,"d":"1.00"},"acre",{"v":0,"d":"$0.00"},{"v":1,"d":"100%"},{"v":0,"d":"$0.00"},{"v":0,"d":"$0.00"},{"v":0,"d":"$0.00"}]
["Self Propelled Equipment",{"v":1,"d":"1.00"},"acre",{"v":0,"d":"$0.00"},{"v":1,"d":"100%"},{"v":0,"d":"$0.00"},{"v":0,"d":"$0.00"},{"v":0,"d":"$0.00"}]
["Pickup",{"v":1,"d":"1.00"},"acre",{"v":3.63,"d":"$3.63"},{"v":0,"d":"0%"},{"v":3.63,"d":"$3.63"},{"v":3.63,"d":"$3.63"},{"v":0,"d":"$0.00"}]
["Management",{"v":1,"d":"1.00"},"acre",{"v":0,"d":"$0.00"},{"v":0,"d":"0%"},{"v":0,"d":"$0.00"},{"v":0,"d":"$0.00"},{"v":0,"d":"$0.00"}]
["Whole Farm Insurance",{"v":1,"d":"1.00"},"acre",{"v":0,"d":"$0.00"},{"v":0,"d":"0%"},{"$f":"B54*D54","v":{"v":0,"d":"$0.00"}},{"v":0,"d":"$0.00"},{"v":0,"d":"$0.00"}]
["Land",{"v":1,"d":"1.00"},"acre",{"v":26.5,"d":"$26.50"},{"v":1,"d":"100%"},{"$f":"D55*B55","v":{"v":26.5,"d":"$26.50"}},{"$f":"IF($H$6=\"Cash\",D55,F55*(1-E55))","v":{"v":0,"d":"$0.00"}},{"$f":"IF($H$6=\"Cash\",0,F55*E55)","v":{"v":26.5,"d":"$26.50"}}]
["Property Tax",{"v":1,"d":"1.00"},"acre",{"v":0,"d":"$0.00"},{"v":1,"d":"100%"},{"$f":"B56*D56","v":{"v":0,"d":"$0.00"}},{"v":0,"d":"$0.00"},{"v":0,"d":"$0.00"}]
["Total Fixed Expenses",{"$nulls":4},{"$f":"SUM(F48:F56)","v":{"v":53.17999999999999,"d":"$53.18"}},{"$f":"SUM(G48:G56)","v":{"v":26.679999999999996,"d":"$26.68"}},{"$f":"SUM(H48:H56)","v":{"v":26.5,"d":"$26.50"}}]
["Total Specified Expenses",{"$nulls":4},{"$f":"F44+F57","v":{"v":165.0327108352941,"d":"$165.03"}},{"$f":"G44+G57","v":{"v":125.44558870999998,"d":"$125.45"}},{"$f":"H44+H57","v":{"v":39.209125,"d":"$39.21"}}]
["Returns Above Total Specified Expenses",{"$nulls":4},{"$f":"F13-F58","v":{"v":-56.832710835294094,"d":"($56.83)"}},{"$f":"G13-G58","v":{"v":-52.95158870999998,"d":"($52.95)"}},{"$f":"H13-H58","v":{"v":-3.503124999999997,"d":"($3.50)"}}]
[]
["Return on Investment",{"$nulls":4},{"$f":"(F59/F58)","v":{"v":-0.3443724007661382,"d":"-34.44%"}},{"$f":"(G59/G58)","v":{"v":-0.4221080171452765,"d":"-42.21%"}},{"v":-0.0893446359744064,"d":"-8.93%"}]

{"sheet":"Dry Other Crop","index":25,"n_rows":61,"n_cols":9,"rows_kept":61,"merged":[[1,0,1,7],[2,0,2,7],[3,0,3,7]]}
[]
[" Estimated Costs and Returns per Acre"]
[{"$f":"'Universal Input Prices'!A20","v":"Dryland Other Crop"}]
["Projected for 2016"]
[{"$nulls":7},"Rental Agreement","Share"]
["Item ","Quantity","Unit","Price","Landlord"," ",null,"Share","Cash"]
[{"$nulls":4},"Share","Total","Tenant","Landlord"]
["Income"]
["other irrigated crop",{"v":0,"d":"0.0"},{"$f":"'Universal Input Prices'!C20","v":"unit"},{"$f":"'Universal Input Prices'!B20","v":{"v":0,"d":"$0.00"}},{"v":0.33,"d":"33%"},{"$f":"D9*B9","v":{"v":0,"d":"$0.00"}},{"$f":"F9*(1-E9)","v":{"v":0,"d":"$0.00"}},{"$f":"IF(H6=\"Cash\", D55,F9*E9)","v":{"v":0,"d":"$0.00"}}]
["secondary income",{"v":0,"d":"0.00"},{"$f":"'Universal Input Prices'!C20","v":"unit"},{"v":0,"d":"$0.00"},{"v":0.33,"d":"33%"},{"$f":"D10*B10","v":{"v":0,"d":"$0.00"}},{"$f":"F10*(1-E10)","v":{"v":0,"d":"$0.00"}},{"$f":"IF(H6=\"Cash\", 0,F10*E10)","v":{"v":0,"d":"$0.00"}}]
[]
["Total Income",{"$nulls":4},{"$f":"F9+F10","v":{"v":0,"d":"$0.00"}},{"$f":"G9+G10","v":{"v":0,"d":"$0.00"}},{"$f":"H9+H10","v":{"v":0,"d":"$0.00"}}]
[]
["Variable Costs"]
["Seed",{"v":0,"d":"0.00"},"unit",{"v":0,"d":"$0.000"},{"v":0,"d":"0%"},{"$f":"D15*B15","v":{"v":0,"d":"$0.00"}},{"$f":"F15*(1-E15)","v":{"v":0,"d":"$0.00"}},{"$f":"F15*E15","v":{"v":0,"d":"$0.00"}}]
["Fertilizer"]
["fert (N) - NH3 ",{"v":0,"d":"0.0"},"lb",{"$f":"IF(A17=\"\",0,VLOOKUP(A17,'Universal Input Prices'!$A$26:$B$30, 2))","v":{"v":0.25000000000000006,"d":"$0.250"}},{"v":0.33,"d":"33%"},{"$f":"D17*B17","v":{"v":0,"d":"$0.00"}},{"$f":"F17*(1-E17)","v":{"v":0,"d":"$0.00"}},{"$f":"F17*E17","v":{"v":0,"d":"$0.00"}}]
["fert (N) - dry",{"v":0,"d":"0.0"},"lb",{"$f":"IF(A18=\"\",0,VLOOKUP(A18,'Universal Input Prices'!$A$26:$B$30, 2))","v":{"v":0.33043478260869563,"d":"$0.330"}},{"v":0.33,"d":"33%"},{"v":0,"d":"$0.00"},{"v":0,"d":"$0.00"},{"v":0,"d":"$0.00"}]
["fert (N) - liquid",{"v":0,"d":"0.0"},"lb",{"$f":"IF(A19=\"\",0,VLOOKUP(A19,'Universal Input Prices'!$A$26:$B$30, 2))","v":{"v":0.41015625,"d":"$0.410"}},{"v":0.33,"d":"33%"},{"$f":"D19*B19","v":{"v":0,"d":"$0.00"}},{"$f":"F19*(1-E19)","v":{"v":0,"d":"$0.00"}},{"$f":"F19*E19","v":{"v":0,"d":"$0.00"}}]
["fert (P) - dry",{"v":0,"d":"0.0"},"lb",{"$f":"IF(A20=\"\",0,VLOOKUP(A20,'Universal Input Prices'!$A$26:$B$30, 2))","v":{"v":0.42980769230769234,"d":"$0.430"}},{"v":0.33,"d":"33%"},{"$f":"D20*B20","v":{"v":0,"d":"$0.00"}},{"$f":"F20*(1-E20)","v":{"v":0,"d":"$0.00"}},{"$f":"F20*E20","v":{"v":0,"d":"$0.00"}}]
["fert (P) - liquid",{"v":0,"d":"0.0"},"lb",{"$f":"IF(A21=\"\",0,VLOOKUP(A21,'Universal Input Prices'!$A$26:$B$30, 2))","v":{"v":0.47,"d":"$0.470"}},{"v":0.33,"d":"33%"},{"$f":"D21*B21","v":{"v":0,"d":"$0.00"}},{"$f":"F21*(1-E21)","v":{"v":0,"d":"$0.00"}},{"$f":"F21*E21","v":{"v":0,"d":"$0.00"}}]
["Field Operations"]
["herbicide & application",{"v":1,"d":"1.0"},"acre",{"v":0,"d":"$0.00"},{"v":0.33,"d":"33%"},{"$f":"D23*B23","v":{"v":0,"d":"$0.00"}},{"$f":"F23*(1-E23)","v":{"v":0,"d":"$0.00"}},{"$f":"F23*E23","v":{"v":0,"d":"$0.00"}}]
["fertilizer application",{"v":0,"d":"0.0"},"acre",{"v":11.75,"d":"$11.75"},{"v":0.33,"d":"33%"},{"v":0,"d":"$0.00"},{"v":0,"d":"$0.00"},{"v":0,"d":"$0.00"}]
["insecticide & application",{"v":0,"d":"0.0"},"acre",{"v":0,"d":"$0.00"},{"v":0.33,"d":"33%"},{"v":0,"d":"$0.00"},{"v":0,"d":"$0.00"},{"v":0,"d":"$0.00"}]
["custom harvest & haul",{"$f":"B9","v":{"v":0,"d":"0.0"}},{"$f":"C9","v":"unit"},{"v":0,"d":"$0.00"},{"v":0,"d":"0%"},{"v":0,"d":"$0.00"},{"v":0,"d":"$0.00"},{"v":0,"d":"$0.00"}]
["crop consulting",{"v":1,"d":"1.0"},"acre",{"v":0,"d":"$0.00"},{"v":0,"d":"0%"},{"v":0,"d":"$0.00"},{"v":0,"d":"$0.00"},{"v":0,"d":"$0.00"}]
["scouting",{"v":1,"d":"1.0"},"acre",{"v":0,"d":"$0.00"},{"v":0,"d":"0%"},{"$f":"D28*B28","v":{"v":0,"d":"$0.00"}},{"$f":"F28*(1-E28)","v":{"v":0,"d":"$0.00"}},{"$f":"F28*E28","v":{"v":0,"d":"$0.00"}}]
["other ",{"v":1,"d":"1.0"},"acre",{"v":0,"d":"$0.00"},{"v":0,"d":"0%"},{"v":0,"d":"$0.00"},{"v":0,"d":"$0.00"},{"v":0,"d":"$0.00"}]
["other ",{"v":1,"d":"1.0"},"acre",{"v":0,"d":"$0.00"},{"v":0,"d":"0%"},{"v":0,"d":"$0.00"},{"v":0,"d":"$0.00"},{"v":0,"d":"$0.00"}]
["other ",{"v":1,"d":"1.0"},"acre",{"v":0,"d":"$0.00"},{"v":0,"d":"0%"},{"v":0,"d":"$0.00"},{"v":0,"d":"$0.00"},{"v":0,"d":"$0.00"}]
["Crop Insurance",{"v":1,"d":"1.0"},"acre",{"v":0,"d":"$0.00"},{"v":0.33,"d":"33%"},{"v":0,"d":"$0.00"},{"v":0,"d":"$0.00"},{"v":0,"d":"$0.00"}]
["Operator Labor & Hand Labor",{"v":0,"d":"0.00"},"hours",{"$f":"'Universal Input Prices'!$B$31","v":{"v":12.45,"d":"$12.45"}},{"v":0,"d":"0%"},{"v":0,"d":"$0.00"},{"v":0,"d":"$0.00"},{"v":0,"d":"$0.00"}]
["Diesel Fuel - Tractors",{"v":0,"d":"0.00"},"gallons",{"$f":"'Universal Input Prices'!$B$32","v":{"v":1.81,"d":"$1.81"}},{"v":0,"d":"0%"},{"v":0,"d":"$0.00"},{"v":0,"d":"$0.00"},{"v":0,"d":"$0.00"}]
["Gasoline - Pickup",{"v":0,"d":"0.00"},"gallons",{"$f":"'Universal Input Prices'!$B$33","v":{"v":1.926,"d":"$1.93"}},{"v":0,"d":"0%"},{"v":0,"d":"$0.00"},{"v":0,"d":"$0.00"},{"v":0,"d":"$0.00"}]
["Repair & Maintenance"]
["Implements",{"v":0,"d":"0.00"},"acre",{"v":4.47,"d":"$4.47"},{"v":0,"d":"0%"},{"$f":"D37*B37","v":{"v":0,"d":"$0.00"}},{"v":0,"d":"$0.00"},{"v":0,"d":"$0.00"}]
["Tractors",{"v":0,"d":"0.00"},"acre",{"v":5.55,"d":"$5.55"},{"v":0,"d":"0%"},{"$f":"D38*B38","v":{"v":0,"d":"$0.00"}},{"v":0,"d":"$0.00"},{"v":0,"d":"$0.00"}]
["Other Fixed Expenses",{"$f":"0","v":{"v":0,"d":"0.00"}},"acre",{"v":4.04,"d":"$4.04"},{"v":0,"d":"0%"},{"$f":"D39*B39","v":{"v":0,"d":"$0.00"}},{"v":0,"d":"$0.00"},{"v":0,"d":"$0.00"}]
["Self Propelled Equipment",{"v":0,"d":"0.00"},"acre",{"v":0.16,"d":"$0.16"},{"v":1,"d":"100%"},{"$f":"D40*B40","v":{"v":0,"d":"$0.00"}},{"v":0,"d":"$0.00"},{"v":0,"d":"$0.00"}]
["Pickup",{"v":1,"d":"1.00"},"acre",{"v":0,"d":"$0.00"},{"v":0,"d":"0%"},{"$f":"D41*B41","v":{"v":0,"d":"$0.00"}},{"v":0,"d":"$0.00"},{"v":0,"d":"$0.00"}]
["Interest-operating capital",{"$f":"'Universal Input Prices'!$B$35","v":{"v":0.054,"d":"5.40%"}},{"$nulls":3},{"$f":"(SUM(F15:F25,F27:F41))*$B42/2","v":{"v":0,"d":"$0.00"}},{"$f":"(SUM(G15:G25,G27:G41))*$B42/2","v":{"v":0,"d":"$0.00"}},{"$f":"(SUM(H15:H25,H27:H41))*$B42/2","v":{"v":0,"d":"$0.00"}}]
[]
["Total Variable Costs",{"$nulls":4},{"$f":"SUM(F15:F42)","v":{"v":0,"d":"$0.00"}},{"$f":"SUM(G15:G42)","v":{"v":0,"d":"$0.00"}},{"$f":"SUM(H15:H42)","v":{"v":0,"d":"$0.00"}}]
["Returns Above Variable Costs",{"$nulls":4},{"$f":"F12-F44","v":{"v":0,"d":"$0.00"}},{"$f":"G12-G44","v":{"v":0,"d":"$0.00"}},{"$f":"H12-H44","v":{"v":0,"d":"$0.00"}}]
[]
["Fixed Costs"]
["Implements",{"v":0,"d":"0.00"},"acre",{"v":7.04,"d":"$7.04"},{"v":0,"d":"0%"},{"$f":"D48*B48","v":{"v":0,"d":"$0.00"}},{"$f":"F48*(1-E48)","v":{"v":0,"d":"$0.00"}},{"$f":"F48*E48","v":{"v":0,"d":"$0.00"}}]
["Tractors",{"v":0,"d":"0.00"},"acre",{"v":7.89,"d":"$7.89"},{"v":0,"d":"0%"},{"v":0,"d":"$0.00"},{"v":0,"d":"$0.00"},{"v":0,"d":"$0.00"}]
["Other Fixed Expenses",{"v":1,"d":"1.00"},"acre",{"v":0,"d":"$0.00"},{"v":0,"d":"0%"},{"v":0,"d":"$0.00"},{"v":0,"d":"$0.00"},{"v":0,"d":"$0.00"}]
["Self Propelled Equipment",{"v":1,"d":"1.00"},"acre",{"v":0,"d":"$0.00"},{"v":1,"d":"100%"},{"v":0,"d":"$0.00"},{"v":0,"d":"$0.00"},{"v":0,"d":"$0.00"}]
["Pickup",{"v":1,"d":"1.00"},"acre",{"v":0,"d":"$0.00"},{"v":0,"d":"0%"},{"v":0,"d":"$0.00"},{"v":0,"d":"$0.00"},{"v":0,"d":"$0.00"}]
["Management",{"v":1,"d":"1.00"},"acre",{"v":0,"d":"$0.00"},{"v":0,"d":"0%"},{"v":0,"d":"$0.00"},{"v":0,"d":"$0.00"},{"v":0,"d":"$0.00"}]
["Whole Farm Insurance",{"v":1,"d":"1.00"},"acre",{"v":0,"d":"$0.00"},{"v":0,"d":"0%"},{"$f":"B54*D54","v":{"v":0,"d":"$0.00"}},{"v":0,"d":"$0.00"},{"v":0,"d":"$0.00"}]
["Land",{"v":0,"d":"0.00"},"acre",{"v":30,"d":"$30.00"},{"v":1,"d":"100%"},{"$f":"D55*B55","v":{"v":0,"d":"$0.00"}},{"$f":"IF($H$6=\"Cash\",D55,F55*(1-E55))","v":{"v":0,"d":"$0.00"}},{"$f":"IF($H$6=\"Cash\",0,F55*E55)","v":{"v":0,"d":"$0.00"}}]
["Property Tax",{"v":1,"d":"1.00"},"acre",{"v":0,"d":"$0.00"},{"v":1,"d":"100%"},{"$f":"B56*D56","v":{"v":0,"d":"$0.00"}},{"v":0,"d":"$0.00"},{"v":0,"d":"$0.00"}]
["Total Fixed Expenses",{"$nulls":4},{"$f":"SUM(F48:F56)","v":{"v":0,"d":"$0.00"}},{"$f":"SUM(G48:G56)","v":{"v":0,"d":"$0.00"}},{"$f":"SUM(H48:H56)","v":{"v":0,"d":"$0.00"}}]
["Total Specified Expenses",{"$nulls":4},{"$f":"F44+F57","v":{"v":0,"d":"$0.00"}},{"$f":"G44+G57","v":{"v":0,"d":"$0.00"}},{"$f":"H44+H57","v":{"v":0,"d":"$0.00"}}]
["Returns Above Total Specified Expenses",{"$nulls":4},{"$f":"F12-F58","v":{"v":0,"d":"$0.00"}},{"$f":"G12-G58","v":{"v":0,"d":"$0.00"}},{"$f":"H12-H58","v":{"v":0,"d":"$0.00"}}]
[]
["Return on Investment",{"$nulls":4},{"$f":"IF(F58=0,\"-\",(F59/F58))","v":"-"},{"$f":"IF(G58=0,\"-\",(G59/G58))","v":"-"},"-"]

{"sheet":"Break-Even Comparison","index":26,"n_rows":210,"n_cols":9,"rows_kept":210,"merged":[[1,0,1,8],[2,0,2,8],[4,0,4,8],[5,4,5,5],[5,6,5,8],[13,0,13,8],[14,4,14,5],[14,6,14,8],[22,0,22,8],[23,4,23,5],[23,6,23,8],[31,0,31,8],[32,4,32,5],[32,6,32,8],[40,0,40,8],[41,4,41,5],[41,6,41,8],[49,0,49,8],[50,4,50,5],[50,6,50,8],[58,0,58,8],[59,4,59,5],[59,6,59,8],[67,0,67,8],[68,4,68,5],[68,6,68,8],[76,0,76,8],[77,4,77,5],[77,6,77,8],[85,0,85,8],[86,4,86,5],[86,6,86,8],[94,0,94,8],[95,4,95,5],[95,6,95,8],[103,0,103,8],[104,4,104,5],[104,6,104,8],[112,0,112,8],[113,4,113,5],[113,6,113,8],[121,0,121,8],[122,4,122,5],[122,6,122,8],[130,0,130,8],[131,4,131,5],[131,6,131,8],[139,0,139,8],[140,4,140,5],[140,6,140,8],[148,0,148,8],[149,4,149,5],[149,6,149,8],[157,0,157,8],[158,4,158,5],[158,6,158,8],[166,0,166,8],[167,4,167,5],[167,6,167,8],[175,0,175,8],[176,4,176,5],[176,6,176,8],[184,0,184,8],[185,4,185,5],[185,6,185,8],[193,0,193,8],[194,4,194,5],[194,6,194,8],[202,0,202,8],[203,4,203,5],[203,6,203,8]]}
[]
["Comparative Break-Even Analysis Projected for 2016"]
[]
[]
[{"$f":"'Irr Alfalfa'!A3:H3","v":"Irrigated Alfalfa "}]
[{"$nulls":4},"BE Price to Cover Variable Costs",null,"BE Price to Cover Total Costs"]
["Yield","TON",null,null,"Total","Tenant","Total","Tenant","Landlord"]
[{"v":0.75,"d":"75%"},{"$f":"'Irr Alfalfa'!$B$9*$A8","v":{"v":4.125,"d":"4.13"}},{"$f":"'Irr Alfalfa'!$B$9*(1-'Irr Alfalfa'!$E$9)*$A8","v":{"v":2.76375,"d":"2.76"}},{"$f":"'Irr Alfalfa'!$B$9*'Irr Alfalfa'!$E$9*$A8","v":{"v":1.36125,"d":"1.36"}},{"$f":"('Irr Alfalfa'!F$48+(B8-B$10)*('Irr Alfalfa'!$D$26))/B8","v":{"v":107.61584465727626,"d":"$107.62"}},{"$f":"('Irr Alfalfa'!G$48+(C8-C$10)*('Irr Alfalfa'!$D$26))/C8","v":{"v":149.54791187280324,"d":"$149.55"}},{"$f":"('Irr Alfalfa'!F$63+(B8-B$10)*('Irr Alfalfa'!$D$26))/B8","v":{"v":174.35523859667018,"d":"$174.36"}},{"$f":"('Irr Alfalfa'!G$63+(C8-C$10)*('Irr Alfalfa'!$D$26))/C8","v":{"v":205.7396803033776,"d":"$205.74"}},{"$f":"IF($D8=0,\"N/A\",('Irr Alfalfa'!H$63+(D8-D$10)*('Irr Alfalfa'!$D$26))/D8)","v":{"v":112.56474269972452,"d":"$112.56"}}]
[{"v":0.9,"d":"90%"},{"$f":"'Irr Alfalfa'!$B$9*$A9","v":4.95},{"$f":"'Irr Alfalfa'!$B$9*(1-'Irr Alfalfa'!$E$9)*$A9","v":{"v":3.3164999999999996,"d":"3.32"}},{"$f":"'Irr Alfalfa'!$B$9*'Irr Alfalfa'!$E$9*$A9","v":{"v":1.6335000000000002,"d":"1.63"}},{"$f":"('Irr Alfalfa'!F$48+(B9-B$10)*('Irr Alfalfa'!$D$26))/B9","v":{"v":96.34653721439688,"d":"$96.35"}},{"$f":"('Irr Alfalfa'!G$48+(C9-C$10)*('Irr Alfalfa'!$D$26))/C9","v":{"v":131.28992656066936,"d":"$131.29"}},{"$f":"('Irr Alfalfa'!F$63+(B9-B$10)*('Irr Alfalfa'!$D$26))/B9","v":{"v":151.96269883055848,"d":"$151.96"}},{"$f":"('Irr Alfalfa'!G$63+(C9-C$10)*('Irr Alfalfa'!$D$26))/C9","v":{"v":178.11640025281469,"d":"$178.12"}},{"$f":"IF($D9=0,\"N/A\",('Irr Alfalfa'!H$63+(D9-D$10)*('Irr Alfalfa'!$D$26))/D9)","v":{"v":100.4706189164371,"d":"$100.47"}}]
[{"v":1,"d":"100%"},{"$f":"'Irr Alfalfa'!$B$9*$A10","v":{"v":5.5,"d":"5.50"}},{"$f":"'Irr Alfalfa'!$B$9*(1-'Irr Alfalfa'!$E$9)*$A10","v":{"v":3.6849999999999996,"d":"3.69"}},{"$f":"'Irr Alfalfa'!$B$9*'Irr Alfalfa'!$E$9*$A10","v":{"v":1.8150000000000002,"d":"1.82"}},{"$f":"('Irr Alfalfa'!F$48+(B10-B$10)*('Irr Alfalfa'!$D$26))/B10","v":{"v":90.7118834929572,"d":"$90.71"}},{"$f":"('Irr Alfalfa'!G$48+(C10-C$10)*('Irr Alfalfa'!$D$26))/C10","v":{"v":122.16093390460243,"d":"$122.16"}},{"$f":"('Irr Alfalfa'!F$63+(B10-B$10)*('Irr Alfalfa'!$D$26))/B10","v":{"v":140.76642894750265,"d":"$140.77"}},{"$f":"('Irr Alfalfa'!G$63+(C10-C$10)*('Irr Alfalfa'!$D$26))/C10","v":{"v":164.30476022753322,"d":"$164.30"}},{"$f":"IF($D10=0,\"N/A\",('Irr Alfalfa'!H$63+(D10-D$10)*('Irr Alfalfa'!$D$26))/D10)","v":{"v":94.42355702479338,"d":"$94.42"}}]
[{"v":1.1,"d":"110%"},{"$f":"'Irr Alfalfa'!$B$9*$A11","v":{"v":6.050000000000001,"d":"6.05"}},{"$f":"'Irr Alfalfa'!$B$9*(1-'Irr Alfalfa'!$E$9)*$A11","v":{"v":4.0535,"d":"4.05"}},{"$f":"'Irr Alfalfa'!$B$9*'Irr Alfalfa'!$E$9*$A11","v":{"v":1.9965000000000004,"d":"2.00"}},{"$f":"('Irr Alfalfa'!F$48+(B11-B$10)*('Irr Alfalfa'!$D$26))/B11","v":{"v":86.10171226632471,"d":"$86.10"}},{"$f":"('Irr Alfalfa'!G$48+(C11-C$10)*('Irr Alfalfa'!$D$26))/C11","v":{"v":114.69175809509312,"d":"$114.69"}},{"$f":"('Irr Alfalfa'!F$63+(B11-B$10)*('Irr Alfalfa'!$D$26))/B11","v":{"v":131.60584449772966,"d":"$131.61"}},{"$f":"('Irr Alfalfa'!G$63+(C11-C$10)*('Irr Alfalfa'!$D$26))/C11","v":{"v":153.00432747957566,"d":"$153.00"}},{"$f":"IF($D11=0,\"N/A\",('Irr Alfalfa'!H$63+(D11-D$10)*('Irr Alfalfa'!$D$26))/D11)","v":{"v":89.47596093163035,"d":"$89.48"}}]
[{"v":1.25,"d":"125%"},{"$f":"'Irr Alfalfa'!$B$9*$A12","v":{"v":6.875,"d":"6.88"}},{"$f":"'Irr Alfalfa'!$B$9*(1-'Irr Alfalfa'!$E$9)*$A12","v":{"v":4.606249999999999,"d":"4.61"}},{"$f":"'Irr Alfalfa'!$B$9*'Irr Alfalfa'!$E$9*$A12","v":{"v":2.2687500000000003,"d":"2.27"}},{"$f":"('Irr Alfalfa'!F$48+(B12-B$10)*('Irr Alfalfa'!$D$26))/B12","v":{"v":80.56950679436575,"d":"$80.57"}},{"$f":"('Irr Alfalfa'!G$48+(C12-C$10)*('Irr Alfalfa'!$D$26))/C12","v":{"v":105.72874712368194,"d":"$105.73"}},{"$f":"('Irr Alfalfa'!F$63+(B12-B$10)*('Irr Alfalfa'!$D$26))/B12","v":{"v":120.61314315800212,"d":"$120.61"}},{"$f":"('Irr Alfalfa'!G$63+(C12-C$10)*('Irr Alfalfa'!$D$26))/C12","v":{"v":139.4438081820266,"d":"$139.44"}},{"$f":"IF($D12=0,\"N/A\",('Irr Alfalfa'!H$63+(D12-D$10)*('Irr Alfalfa'!$D$26))/D12)","v":{"v":83.5388456198347,"d":"$83.54"}}]
[]
[{"$f":"'Irr Canola'!A3:H3","v":"Irrigated Canola"}]
[{"$nulls":4},"BE Price to Cover Variable Costs",null,"BE Price to Cover Total Costs"]
["Yield","CWT",null,null,"Total","Tenant","Total","Tenant","Landlord"]
[{"v":0.75,"d":"75%"},{"$f":"'Irr Canola'!$B$9*$A17","v":{"v":16.5,"d":"16.50"}},{"$f":"'Irr Canola'!$B$9*(1-'Irr Canola'!$E$9)*$A17","v":{"v":11.055,"d":"11.06"}},{"$f":"'Irr Canola'!$B$9*'Irr Canola'!$E$9*$A17","v":{"v":5.445,"d":"5.45"}},{"$f":"('Irr Canola'!F$49+(B17-B$19)*('Irr Canola'!$D$27))/B17","v":{"v":17.078770002048437,"d":"$17.08"}},{"$f":"('Irr Canola'!G$49+(C17-C$19)*('Irr Canola'!$D$27))/C17","v":{"v":22.061237220186932,"d":"$22.06"}},{"$f":"('Irr Canola'!F$63+(B17-B$19)*('Irr Canola'!$D$27))/B17","v":{"v":26.76301242629086,"d":"$26.76"}},{"$f":"('Irr Canola'!G$63+(C17-C$19)*('Irr Canola'!$D$27))/C17","v":{"v":30.002440295718365,"d":"$30.00"}},{"$f":"IF($D17=0,\"N/A\",('Irr Canola'!H$63+(D17-D$19)*('Irr Canola'!$D$27))/D17)","v":{"v":20.089257088423764,"d":"$20.09"}}]
[{"v":0.9,"d":"90%"},{"$f":"'Irr Canola'!$B$9*$A18","v":{"v":19.8,"d":"19.80"}},{"$f":"'Irr Canola'!$B$9*(1-'Irr Canola'!$E$9)*$A18","v":{"v":13.265999999999998,"d":"13.27"}},{"$f":"'Irr Canola'!$B$9*'Irr Canola'!$E$9*$A18","v":{"v":6.534000000000001,"d":"6.53"}},{"$f":"('Irr Canola'!F$49+(B18-B$19)*('Irr Canola'!$D$27))/B18","v":{"v":14.307308335040366,"d":"$14.31"}},{"$f":"('Irr Canola'!G$49+(C18-C$19)*('Irr Canola'!$D$27))/C18","v":{"v":18.45936435015578,"d":"$18.46"}},{"$f":"('Irr Canola'!F$63+(B18-B$19)*('Irr Canola'!$D$27))/B18","v":{"v":22.377510355242382,"d":"$22.38"}},{"$f":"('Irr Canola'!G$63+(C18-C$19)*('Irr Canola'!$D$27))/C18","v":{"v":25.077033579765306,"d":"$25.08"}},{"$f":"IF($D18=0,\"N/A\",('Irr Canola'!H$63+(D18-D$19)*('Irr Canola'!$D$27))/D18)","v":{"v":16.81604757368647,"d":"$16.82"}}]
[{"v":1,"d":"100%"},{"$f":"'Irr Canola'!$B$9*$A19","v":{"v":22,"d":"22.00"}},{"$f":"'Irr Canola'!$B$9*(1-'Irr Canola'!$E$9)*$A19","v":{"v":14.739999999999998,"d":"14.74"}},{"$f":"'Irr Canola'!$B$9*'Irr Canola'!$E$9*$A19","v":{"v":7.260000000000001,"d":"7.26"}},{"$f":"('Irr Canola'!F$49+(B19-B$19)*('Irr Canola'!$D$27))/B19","v":{"v":12.92157750153633,"d":"$12.92"}},{"$f":"('Irr Canola'!G$49+(C19-C$19)*('Irr Canola'!$D$27))/C19","v":{"v":16.6584279151402,"d":"$16.66"}},{"$f":"('Irr Canola'!F$63+(B19-B$19)*('Irr Canola'!$D$27))/B19","v":{"v":20.184759319718147,"d":"$20.18"}},{"$f":"('Irr Canola'!G$63+(C19-C$19)*('Irr Canola'!$D$27))/C19","v":{"v":22.614330221788776,"d":"$22.61"}},{"$f":"IF($D19=0,\"N/A\",('Irr Canola'!H$63+(D19-D$19)*('Irr Canola'!$D$27))/D19)","v":{"v":15.179442816317822,"d":"$15.18"}}]
[{"v":1.1,"d":"110%"},{"$f":"'Irr Canola'!$B$9*$A20","v":{"v":24.200000000000003,"d":"24.20"}},{"$f":"'Irr Canola'!$B$9*(1-'Irr Canola'!$E$9)*$A20","v":{"v":16.214,"d":"16.21"}},{"$f":"'Irr Canola'!$B$9*'Irr Canola'!$E$9*$A20","v":{"v":7.9860000000000015,"d":"7.99"}},{"$f":"('Irr Canola'!F$49+(B20-B$19)*('Irr Canola'!$D$27))/B20","v":{"v":11.78779772866939,"d":"$11.79"}},{"$f":"('Irr Canola'!G$49+(C20-C$19)*('Irr Canola'!$D$27))/C20","v":{"v":15.184934468309274,"d":"$15.18"}},{"$f":"('Irr Canola'!F$63+(B20-B$19)*('Irr Canola'!$D$27))/B20","v":{"v":18.39069029065286,"d":"$18.39"}},{"$f":"('Irr Canola'!G$63+(C20-C$19)*('Irr Canola'!$D$27))/C20","v":{"v":20.599391110717068,"d":"$20.60"}},{"$f":"IF($D20=0,\"N/A\",('Irr Canola'!H$63+(D20-D$19)*('Irr Canola'!$D$27))/D20)","v":{"v":13.84040256028893,"d":"$13.84"}}]
[{"v":1.25,"d":"125%"},{"$f":"'Irr Canola'!$B$9*$A21","v":{"v":27.5,"d":"27.50"}},{"$f":"'Irr Canola'!$B$9*(1-'Irr Canola'!$E$9)*$A21","v":{"v":18.424999999999997,"d":"18.43"}},{"$f":"'Irr Canola'!$B$9*'Irr Canola'!$E$9*$A21","v":{"v":9.075000000000001,"d":"9.08"}},{"$f":"('Irr Canola'!F$49+(B21-B$19)*('Irr Canola'!$D$27))/B21","v":{"v":10.427262001229064,"d":"$10.43"}},{"$f":"('Irr Canola'!G$49+(C21-C$19)*('Irr Canola'!$D$27))/C21","v":{"v":13.416742332112163,"d":"$13.42"}},{"$f":"('Irr Canola'!F$63+(B21-B$19)*('Irr Canola'!$D$27))/B21","v":{"v":16.23780745577452,"d":"$16.24"}},{"$f":"('Irr Canola'!G$63+(C21-C$19)*('Irr Canola'!$D$27))/C21","v":{"v":18.18146417743102,"d":"$18.18"}},{"$f":"IF($D21=0,\"N/A\",('Irr Canola'!H$63+(D21-D$19)*('Irr Canola'!$D$27))/D21)","v":{"v":12.233554253054258,"d":"$12.23"}}]
[]
[{"$f":"'Irr Corn'!A3:H3","v":"Irrigated Corn"}]
[{"$nulls":4},"BE Price to Cover Variable Costs",null,"BE Price to Cover Total Costs"]
["Yield","BU",null,null,"Total","Tenant","Total","Tenant","Landlord"]
[{"v":0.75,"d":"75%"},{"$f":"'Irr Corn'!$B$9*$A26","v":168.75},{"$f":"'Irr Corn'!$B$9*(1-'Irr Corn'!$E$9)*$A26","v":{"v":113.06249999999997,"d":"113.06"}},{"$f":"'Irr Corn'!$B$9*'Irr Corn'!$E$9*$A26","v":{"v":55.6875,"d":"55.69"}},{"$f":"('Irr Corn'!F$47+(B26-B$28)*('Irr Corn'!$D$25))/B26","v":{"v":3.656345143813634,"d":"$3.66"}},{"$f":"('Irr Corn'!G$47+(C26-C$28)*('Irr Corn'!$D$25))/C26","v":{"v":4.782666243698551,"d":"$4.78"}},{"$f":"('Irr Corn'!F$61+(B26-B$28)*('Irr Corn'!$D$25))/B26","v":{"v":5.013382180850671,"d":"$5.01"}},{"$f":"('Irr Corn'!G$61+(C26-C$28)*('Irr Corn'!$D$25))/C26","v":{"v":6.808094657186666,"d":"$6.81"}},{"$f":"IF($D26=0,\"N/A\",('Irr Corn'!H$61+(D26-D$28)*('Irr Corn'!$D$25))/D26)","v":{"v":1.453828601851852,"d":"$1.45"}}]
[{"v":0.9,"d":"90%"},{"$f":"'Irr Corn'!$B$9*$A27","v":{"v":202.5,"d":"202.50"}},{"$f":"'Irr Corn'!$B$9*(1-'Irr Corn'!$E$9)*$A27","v":{"v":135.67499999999998,"d":"135.68"}},{"$f":"'Irr Corn'!$B$9*'Irr Corn'!$E$9*$A27","v":{"v":66.825,"d":"66.83"}},{"$f":"('Irr Corn'!F$47+(B27-B$28)*('Irr Corn'!$D$25))/B27","v":{"v":3.113620953178028,"d":"$3.11"}},{"$f":"('Irr Corn'!G$47+(C27-C$28)*('Irr Corn'!$D$25))/C27","v":{"v":4.052221869748792,"d":"$4.05"}},{"$f":"('Irr Corn'!F$61+(B27-B$28)*('Irr Corn'!$D$25))/B27","v":{"v":4.2444851507088925,"d":"$4.24"}},{"$f":"('Irr Corn'!G$61+(C27-C$28)*('Irr Corn'!$D$25))/C27","v":{"v":5.7400788809888885,"d":"$5.74"}},{"$f":"IF($D27=0,\"N/A\",('Irr Corn'!H$61+(D27-D$28)*('Irr Corn'!$D$25))/D27)","v":{"v":1.27819050154321,"d":"$1.28"}}]
[{"v":1,"d":"100%"},{"$f":"'Irr Corn'!$B$9*$A28","v":{"v":225,"d":"225.00"}},{"$f":"'Irr Corn'!$B$9*(1-'Irr Corn'!$E$9)*$A28","v":{"v":150.74999999999997,"d":"150.75"}},{"$f":"'Irr Corn'!$B$9*'Irr Corn'!$E$9*$A28","v":74.25},{"$f":"('Irr Corn'!F$47+(B28-B$28)*('Irr Corn'!$D$25))/B28","v":{"v":2.8422588578602253,"d":"$2.84"}},{"$f":"('Irr Corn'!G$47+(C28-C$28)*('Irr Corn'!$D$25))/C28","v":{"v":3.686999682773913,"d":"$3.69"}},{"$f":"('Irr Corn'!F$61+(B28-B$28)*('Irr Corn'!$D$25))/B28","v":{"v":3.860036635638003,"d":"$3.86"}},{"$f":"('Irr Corn'!G$61+(C28-C$28)*('Irr Corn'!$D$25))/C28","v":{"v":5.20607099289,"d":"$5.21"}},{"$f":"IF($D28=0,\"N/A\",('Irr Corn'!H$61+(D28-D$28)*('Irr Corn'!$D$25))/D28)","v":{"v":1.190371451388889,"d":"$1.19"}}]
[{"v":1.1,"d":"110%"},{"$f":"'Irr Corn'!$B$9*$A29","v":{"v":247.50000000000003,"d":"247.50"}},{"$f":"'Irr Corn'!$B$9*(1-'Irr Corn'!$E$9)*$A29","v":{"v":165.825,"d":"165.83"}},{"$f":"'Irr Corn'!$B$9*'Irr Corn'!$E$9*$A29","v":{"v":81.67500000000001,"d":"81.68"}},{"$f":"('Irr Corn'!F$47+(B29-B$28)*('Irr Corn'!$D$25))/B29","v":{"v":2.6202353253274775,"d":"$2.62"}},{"$f":"('Irr Corn'!G$47+(C29-C$28)*('Irr Corn'!$D$25))/C29","v":{"v":3.388181529794466,"d":"$3.39"}},{"$f":"('Irr Corn'!F$61+(B29-B$28)*('Irr Corn'!$D$25))/B29","v":{"v":3.5454878505800025,"d":"$3.55"}},{"$f":"('Irr Corn'!G$61+(C29-C$28)*('Irr Corn'!$D$25))/C29","v":{"v":4.7691554480818175,"d":"$4.77"}},{"$f":"IF($D29=0,\"N/A\",('Irr Corn'!H$61+(D29-D$28)*('Irr Corn'!$D$25))/D29)","v":{"v":1.1185195012626261,"d":"$1.12"}}]
[{"v":1.25,"d":"125%"},{"$f":"'Irr Corn'!$B$9*$A30","v":281.25},{"$f":"'Irr Corn'!$B$9*(1-'Irr Corn'!$E$9)*$A30","v":{"v":188.43749999999997,"d":"188.44"}},{"$f":"'Irr Corn'!$B$9*'Irr Corn'!$E$9*$A30","v":{"v":92.8125,"d":"92.81"}},{"$f":"('Irr Corn'!F$47+(B30-B$28)*('Irr Corn'!$D$25))/B30","v":{"v":2.3538070862881804,"d":"$2.35"}},{"$f":"('Irr Corn'!G$47+(C30-C$28)*('Irr Corn'!$D$25))/C30","v":{"v":3.0295997462191306,"d":"$3.03"}},{"$f":"('Irr Corn'!F$61+(B30-B$28)*('Irr Corn'!$D$25))/B30","v":{"v":3.1680293085104028,"d":"$3.17"}},{"$f":"('Irr Corn'!G$61+(C30-C$28)*('Irr Corn'!$D$25))/C30","v":{"v":4.244856794312,"d":"$4.24"}},{"$f":"IF($D30=0,\"N/A\",('Irr Corn'!H$61+(D30-D$28)*('Irr Corn'!$D$25))/D30)","v":{"v":1.0322971611111111,"d":"$1.03"}}]
[]
[{"$f":"'Irr Corn Silage'!A3:H3","v":"Irrigated Corn Silage"}]
[{"$nulls":4},"BE Price to Cover Variable Costs",null,"BE Price to Cover Total Costs"]
["Yield","TON",null,null,"Total","Tenant","Total","Tenant","Landlord"]
[{"v":0.75,"d":"75%"},{"$f":"'Irr Corn Silage'!$B$9*$A35","v":20.25},{"$f":"'Irr Corn Silage'!$B$9*(1-'Irr Corn Silage'!$E$9)*$A35","v":{"v":13.567499999999997,"d":"13.57"}},{"$f":"'Irr Corn Silage'!$B$9*'Irr Corn Silage'!$E$9*$A35","v":{"v":6.6825,"d":"6.68"}},{"$f":"('Irr Corn Silage'!F$47+(B35-B$37)*('Irr Corn Silage'!$D$25))/B35","v":{"v":36.75330382548499,"d":"$36.75"}},{"$f":"('Irr Corn Silage'!G$47+(C35-C$37)*('Irr Corn Silage'!$D$25))/C35","v":{"v":50.25352060712582,"d":"$50.25"}},{"$f":"('Irr Corn Silage'!F$61+(B35-B$37)*('Irr Corn Silage'!$D$25))/B35","v":{"v":48.27478530696647,"d":"$48.27"}},{"$f":"('Irr Corn Silage'!G$61+(C35-C$37)*('Irr Corn Silage'!$D$25))/C35","v":{"v":58.60509606317889,"d":"$58.61"}},{"$f":"IF($D35=0,\"N/A\",('Irr Corn Silage'!H$61+(D35-D$37)*('Irr Corn Silage'!$D$25))/D35)","v":{"v":28.043577293771047,"d":"$28.04"}}]
[{"v":0.9,"d":"90%"},{"$f":"'Irr Corn Silage'!$B$9*$A36","v":{"v":24.3,"d":"24.30"}},{"$f":"'Irr Corn Silage'!$B$9*(1-'Irr Corn Silage'!$E$9)*$A36","v":{"v":16.281,"d":"16.28"}},{"$f":"'Irr Corn Silage'!$B$9*'Irr Corn Silage'!$E$9*$A36","v":{"v":8.019,"d":"8.02"}},{"$f":"('Irr Corn Silage'!F$47+(B36-B$37)*('Irr Corn Silage'!$D$25))/B36","v":{"v":32.13441985457082,"d":"$32.13"}},{"$f":"('Irr Corn Silage'!G$47+(C36-C$37)*('Irr Corn Silage'!$D$25))/C36","v":{"v":43.38460050593818,"d":"$43.38"}},{"$f":"('Irr Corn Silage'!F$61+(B36-B$37)*('Irr Corn Silage'!$D$25))/B36","v":{"v":41.73565442247205,"d":"$41.74"}},{"$f":"('Irr Corn Silage'!G$61+(C36-C$37)*('Irr Corn Silage'!$D$25))/C36","v":{"v":50.344246719315734,"d":"$50.34"}},{"$f":"IF($D36=0,\"N/A\",('Irr Corn Silage'!H$61+(D36-D$37)*('Irr Corn Silage'!$D$25))/D36)","v":{"v":24.87631441147587,"d":"$24.88"}}]
[{"v":1,"d":"100%"},{"$f":"'Irr Corn Silage'!$B$9*$A37","v":{"v":27,"d":"27.00"}},{"$f":"'Irr Corn Silage'!$B$9*(1-'Irr Corn Silage'!$E$9)*$A37","v":{"v":18.089999999999996,"d":"18.09"}},{"$f":"'Irr Corn Silage'!$B$9*'Irr Corn Silage'!$E$9*$A37","v":8.91},{"$f":"('Irr Corn Silage'!F$47+(B37-B$37)*('Irr Corn Silage'!$D$25))/B37","v":{"v":29.82497786911374,"d":"$29.82"}},{"$f":"('Irr Corn Silage'!G$47+(C37-C$37)*('Irr Corn Silage'!$D$25))/C37","v":{"v":39.95014045534437,"d":"$39.95"}},{"$f":"('Irr Corn Silage'!F$61+(B37-B$37)*('Irr Corn Silage'!$D$25))/B37","v":{"v":38.46608898022485,"d":"$38.47"}},{"$f":"('Irr Corn Silage'!G$61+(C37-C$37)*('Irr Corn Silage'!$D$25))/C37","v":{"v":46.21382204738416,"d":"$46.21"}},{"$f":"IF($D37=0,\"N/A\",('Irr Corn Silage'!H$61+(D37-D$37)*('Irr Corn Silage'!$D$25))/D37)","v":{"v":23.292682970328286,"d":"$23.29"}}]
[{"v":1.1,"d":"110%"},{"$f":"'Irr Corn Silage'!$B$9*$A38","v":{"v":29.700000000000003,"d":"29.70"}},{"$f":"'Irr Corn Silage'!$B$9*(1-'Irr Corn Silage'!$E$9)*$A38","v":{"v":19.898999999999997,"d":"19.90"}},{"$f":"'Irr Corn Silage'!$B$9*'Irr Corn Silage'!$E$9*$A38","v":{"v":9.801,"d":"9.80"}},{"$f":"('Irr Corn Silage'!F$47+(B38-B$37)*('Irr Corn Silage'!$D$25))/B38","v":{"v":27.935434426467037,"d":"$27.94"}},{"$f":"('Irr Corn Silage'!G$47+(C38-C$37)*('Irr Corn Silage'!$D$25))/C38","v":{"v":37.1401276866767,"d":"$37.14"}},{"$f":"('Irr Corn Silage'!F$61+(B38-B$37)*('Irr Corn Silage'!$D$25))/B38","v":{"v":35.790989982022595,"d":"$35.79"}},{"$f":"('Irr Corn Silage'!G$61+(C38-C$37)*('Irr Corn Silage'!$D$25))/C38","v":{"v":42.83438367944015,"d":"$42.83"}},{"$f":"IF($D38=0,\"N/A\",('Irr Corn Silage'!H$61+(D38-D$37)*('Irr Corn Silage'!$D$25))/D38)","v":{"v":21.99698451848026,"d":"$22.00"}}]
[{"v":1.25,"d":"125%"},{"$f":"'Irr Corn Silage'!$B$9*$A39","v":33.75},{"$f":"'Irr Corn Silage'!$B$9*(1-'Irr Corn Silage'!$E$9)*$A39","v":{"v":22.612499999999997,"d":"22.61"}},{"$f":"'Irr Corn Silage'!$B$9*'Irr Corn Silage'!$E$9*$A39","v":{"v":11.1375,"d":"11.14"}},{"$f":"('Irr Corn Silage'!F$47+(B39-B$37)*('Irr Corn Silage'!$D$25))/B39","v":{"v":25.667982295290994,"d":"$25.67"}},{"$f":"('Irr Corn Silage'!G$47+(C39-C$37)*('Irr Corn Silage'!$D$25))/C39","v":{"v":33.76811236427549,"d":"$33.77"}},{"$f":"('Irr Corn Silage'!F$61+(B39-B$37)*('Irr Corn Silage'!$D$25))/B39","v":{"v":32.58087118417988,"d":"$32.58"}},{"$f":"('Irr Corn Silage'!G$61+(C39-C$37)*('Irr Corn Silage'!$D$25))/C39","v":{"v":38.77905763790733,"d":"$38.78"}},{"$f":"IF($D39=0,\"N/A\",('Irr Corn Silage'!H$61+(D39-D$37)*('Irr Corn Silage'!$D$25))/D39)","v":{"v":20.442146376262627,"d":"$20.44"}}]
[]
[{"$f":"'Irr Cotton'!A3:H3","v":"Irrigated Cotton"}]
[{"$nulls":4},"BE Price to Cover Variable Costs",null,"BE Price to Cover Total Costs"]
["Yield","LB",null,null,"Total","Tenant","Total","Tenant","Landlord"]
[{"v":0.75,"d":"75%"},{"$f":"'Irr Cotton'!$B$9*$A44","v":{"v":937.5,"d":"937.50"}},{"$f":"'Irr Cotton'!$B$9*(1-'Irr Cotton'!$E$9)*$A44","v":{"v":628.1249999999999,"d":"628.13"}},{"$f":"'Irr Cotton'!$B$9*'Irr Cotton'!$E$9*$A44","v":{"v":309.375,"d":"309.38"}},{"$f":"('Irr Cotton'!F$52-B44/500*'Universal Input Prices'!$B$39/2000*Cottonseed_Price+(B44-B$46)/100*'Irr Cotton'!$D$29+(B44-B$46)/'Irr Cotton'!$B$11/100*'Irr Cotton'!D$30)/B44","v":{"v":0.4798758539700521,"d":"$0.48"}},{"$f":"('Irr Cotton'!G$52-C44/500*'Universal Input Prices'!$B$39/2000*Cottonseed_Price+(C44-C$46)/100*'Irr Cotton'!$D$29+(C44-C$46)/'Irr Cotton'!$B$11/100*'Irr Cotton'!$D$30)/C44","v":{"v":0.6303803321183028,"d":"$0.63"}},{"$f":"('Irr Cotton'!F$66-B44/500*'Universal Input Prices'!$B$39/2000*Cottonseed_Price+(B44-B$46)/100*'Irr Cotton'!$D$29+(B44-B$46)/'Irr Cotton'!$B$11/100*'Irr Cotton'!$D$30)/B44","v":{"v":0.6423185206367187,"d":"$0.64"}},{"$f":"('Irr Cotton'!G$66-C44/500*'Universal Input Prices'!$B$39/2000*Cottonseed_Price+(C44-C$46)/100*'Irr Cotton'!$D$29+(C44-C$46)/100*'Irr Cotton'!$B$11*'Irr Cotton'!$D$30)/C44","v":{"v":0.7893464348044135,"d":"$0.79"}},{"$f":"IF($D44=0,\"N/A\",('Irr Cotton'!H$66-D44/500*'Universal Input Prices'!$B$39/2000*Cottonseed_Price+(D44-D$46)/100*'Irr Cotton'!$D$29+(D44-D$46)/100*'Irr Cotton'!$B$11*'Irr Cotton'!$D$30)/D44)","v":{"v":0.43540969260734186,"d":"$0.44"}}]
[{"v":0.9,"d":"90%"},{"$f":"'Irr Cotton'!$B$9*$A45","v":{"v":1125,"d":"1125.00"}},{"$f":"'Irr Cotton'!$B$9*(1-'Irr Cotton'!$E$9)*$A45","v":{"v":753.7499999999999,"d":"753.75"}},{"$f":"'Irr Cotton'!$B$9*'Irr Cotton'!$E$9*$A45","v":371.25},{"$f":"('Irr Cotton'!F$52-B45/500*'Universal Input Prices'!$B$39/2000*Cottonseed_Price+(B45-B$46)/100*'Irr Cotton'!$D$29+(B45-B$46)/'Irr Cotton'!$B$11/100*'Irr Cotton'!D$30)/B45","v":{"v":0.40504945017382016,"d":"$0.41"}},{"$f":"('Irr Cotton'!G$52-C45/500*'Universal Input Prices'!$B$39/2000*Cottonseed_Price+(C45-C$46)/100*'Irr Cotton'!$D$29+(C45-C$46)/'Irr Cotton'!$B$11/100*'Irr Cotton'!$D$30)/C45","v":{"v":0.5304698486306957,"d":"$0.53"}},{"$f":"('Irr Cotton'!F$66-B45/500*'Universal Input Prices'!$B$39/2000*Cottonseed_Price+(B45-B$46)/100*'Irr Cotton'!$D$29+(B45-B$46)/'Irr Cotton'!$B$11/100*'Irr Cotton'!$D$30)/B45","v":{"v":0.540418339062709,"d":"$0.54"}},{"$f":"('Irr Cotton'!G$66-C45/500*'Universal Input Prices'!$B$39/2000*Cottonseed_Price+(C45-C$46)/100*'Irr Cotton'!$D$29+(C45-C$46)/100*'Irr Cotton'!$B$11*'Irr Cotton'!$D$30)/C45","v":{"v":0.6473709873370113,"d":"$0.65"}},{"$f":"IF($D45=0,\"N/A\",('Irr Cotton'!H$66-D45/500*'Universal Input Prices'!$B$39/2000*Cottonseed_Price+(D45-D$46)/100*'Irr Cotton'!$D$29+(D45-D$46)/100*'Irr Cotton'!$B$11*'Irr Cotton'!$D$30)/D45)","v":{"v":0.3524237021727849,"d":"$0.35"}}]
[{"v":1,"d":"100%"},{"$f":"'Irr Cotton'!$B$9*$A46","v":{"v":1250,"d":"1250.00"}},{"$f":"'Irr Cotton'!$B$9*(1-'Irr Cotton'!$E$9)*$A46","v":{"v":837.4999999999999,"d":"837.50"}},{"$f":"'Irr Cotton'!$B$9*'Irr Cotton'!$E$9*$A46","v":{"v":412.5,"d":"412.50"}},{"$f":"('Irr Cotton'!F$52-B46/500*'Universal Input Prices'!$B$39/2000*Cottonseed_Price+(B46-B$46)/100*'Irr Cotton'!$D$29+(B46-B$46)/'Irr Cotton'!$B$11/100*'Irr Cotton'!D$30)/B46","v":{"v":0.3676362482757042,"d":"$0.37"}},{"$f":"('Irr Cotton'!G$52-C46/500*'Universal Input Prices'!$B$39/2000*Cottonseed_Price+(C46-C$46)/100*'Irr Cotton'!$D$29+(C46-C$46)/'Irr Cotton'!$B$11/100*'Irr Cotton'!$D$30)/C46","v":{"v":0.4805146068868922,"d":"$0.48"}},{"$f":"('Irr Cotton'!F$66-B46/500*'Universal Input Prices'!$B$39/2000*Cottonseed_Price+(B46-B$46)/100*'Irr Cotton'!$D$29+(B46-B$46)/'Irr Cotton'!$B$11/100*'Irr Cotton'!$D$30)/B46","v":{"v":0.4894682482757042,"d":"$0.49"}},{"$f":"('Irr Cotton'!G$66-C46/500*'Universal Input Prices'!$B$39/2000*Cottonseed_Price+(C46-C$46)/100*'Irr Cotton'!$D$29+(C46-C$46)/100*'Irr Cotton'!$B$11*'Irr Cotton'!$D$30)/C46","v":{"v":0.57638326360331,"d":"$0.58"}},{"$f":"IF($D46=0,\"N/A\",('Irr Cotton'!H$66-D46/500*'Universal Input Prices'!$B$39/2000*Cottonseed_Price+(D46-D$46)/100*'Irr Cotton'!$D$29+(D46-D$46)/100*'Irr Cotton'!$B$11*'Irr Cotton'!$D$30)/D46)","v":{"v":0.3109307069555064,"d":"$0.31"}}]
[{"v":1.1,"d":"110%"},{"$f":"'Irr Cotton'!$B$9*$A47","v":{"v":1375,"d":"1375.00"}},{"$f":"'Irr Cotton'!$B$9*(1-'Irr Cotton'!$E$9)*$A47","v":921.25},{"$f":"'Irr Cotton'!$B$9*'Irr Cotton'!$E$9*$A47","v":{"v":453.75000000000006,"d":"453.75"}},{"$f":"('Irr Cotton'!F$52-B47/500*'Universal Input Prices'!$B$39/2000*Cottonseed_Price+(B47-B$46)/100*'Irr Cotton'!$D$29+(B47-B$46)/'Irr Cotton'!$B$11/100*'Irr Cotton'!D$30)/B47","v":{"v":0.33702544672270024,"d":"$0.34"}},{"$f":"('Irr Cotton'!G$52-C47/500*'Universal Input Prices'!$B$39/2000*Cottonseed_Price+(C47-C$46)/100*'Irr Cotton'!$D$29+(C47-C$46)/'Irr Cotton'!$B$11/100*'Irr Cotton'!$D$30)/C47","v":{"v":0.4396421363692347,"d":"$0.44"}},{"$f":"('Irr Cotton'!F$66-B47/500*'Universal Input Prices'!$B$39/2000*Cottonseed_Price+(B47-B$46)/100*'Irr Cotton'!$D$29+(B47-B$46)/'Irr Cotton'!$B$11/100*'Irr Cotton'!$D$30)/B47","v":{"v":0.4477818103590639,"d":"$0.45"}},{"$f":"('Irr Cotton'!G$66-C47/500*'Universal Input Prices'!$B$39/2000*Cottonseed_Price+(C47-C$46)/100*'Irr Cotton'!$D$29+(C47-C$46)/100*'Irr Cotton'!$B$11*'Irr Cotton'!$D$30)/C47","v":{"v":0.5183023987302818,"d":"$0.52"}},{"$f":"IF($D47=0,\"N/A\",('Irr Cotton'!H$66-D47/500*'Universal Input Prices'!$B$39/2000*Cottonseed_Price+(D47-D$46)/100*'Irr Cotton'!$D$29+(D47-D$46)/100*'Irr Cotton'!$B$11*'Irr Cotton'!$D$30)/D47)","v":{"v":0.276981892686824,"d":"$0.28"}}]
[{"v":1.25,"d":"125%"},{"$f":"'Irr Cotton'!$B$9*$A48","v":{"v":1562.5,"d":"1562.50"}},{"$f":"'Irr Cotton'!$B$9*(1-'Irr Cotton'!$E$9)*$A48","v":{"v":1046.8749999999998,"d":"1046.88"}},{"$f":"'Irr Cotton'!$B$9*'Irr Cotton'!$E$9*$A48","v":{"v":515.625,"d":"515.63"}},{"$f":"('Irr Cotton'!F$52-B48/500*'Universal Input Prices'!$B$39/2000*Cottonseed_Price+(B48-B$46)/100*'Irr Cotton'!$D$29+(B48-B$46)/'Irr Cotton'!$B$11/100*'Irr Cotton'!D$30)/B48","v":{"v":0.30029248485909543,"d":"$0.30"}},{"$f":"('Irr Cotton'!G$52-C48/500*'Universal Input Prices'!$B$39/2000*Cottonseed_Price+(C48-C$46)/100*'Irr Cotton'!$D$29+(C48-C$46)/'Irr Cotton'!$B$11/100*'Irr Cotton'!$D$30)/C48","v":{"v":0.39059517174804587,"d":"$0.39"}},{"$f":"('Irr Cotton'!F$66-B48/500*'Universal Input Prices'!$B$39/2000*Cottonseed_Price+(B48-B$46)/100*'Irr Cotton'!$D$29+(B48-B$46)/'Irr Cotton'!$B$11/100*'Irr Cotton'!$D$30)/B48","v":{"v":0.3977580848590955,"d":"$0.40"}},{"$f":"('Irr Cotton'!G$66-C48/500*'Universal Input Prices'!$B$39/2000*Cottonseed_Price+(C48-C$46)/100*'Irr Cotton'!$D$29+(C48-C$46)/100*'Irr Cotton'!$B$11*'Irr Cotton'!$D$30)/C48","v":{"v":0.4486053608826481,"d":"$0.45"}},{"$f":"IF($D48=0,\"N/A\",('Irr Cotton'!H$66-D48/500*'Universal Input Prices'!$B$39/2000*Cottonseed_Price+(D48-D$46)/100*'Irr Cotton'!$D$29+(D48-D$46)/100*'Irr Cotton'!$B$11*'Irr Cotton'!$D$30)/D48)","v":{"v":0.23624331556440512,"d":"$0.24"}}]
[]
[{"$f":"'Irr Peanuts'!A3:H3","v":"Irrigated Peanuts"}]
[{"$nulls":4},"BE Price to Cover Variable Costs",null,"BE Price to Cover Total Costs"]
["Yield","TON",null,null,"Total","Tenant","Total","Tenant","Landlord"]
[{"v":0.75,"d":"75%"},{"$f":"'Irr Peanuts'!$B$9*$A53","v":{"v":1.6875,"d":"1.69"}},{"$f":"'Irr Peanuts'!$B$9*(1-'Irr Peanuts'!$E$9)*$A53","v":{"v":1.1306249999999998,"d":"1.13"}},{"$f":"'Irr Peanuts'!$B$9*'Irr Peanuts'!$E$9*$A53","v":{"v":0.556875,"d":"0.56"}},{"$f":"('Irr Peanuts'!$F$51+($B53-$B$55)*(SUM('Irr Peanuts'!$D$27:$D$28)))/$B53","v":{"v":417.7835187902713,"d":"$417.78"}},{"$f":"('Irr Peanuts'!$G$51+($C53-$C$55)*(SUM('Irr Peanuts'!$D$27:$D$28)))/$C53","v":{"v":556.7306447653328,"d":"$556.73"}},{"$f":"('Irr Peanuts'!$F$65+($B53-$B$55)*(SUM('Irr Peanuts'!$D$27:$D$28)))/$B53","v":{"v":541.1375928643453,"d":"$541.14"}},{"$f":"('Irr Peanuts'!$G$65+($C53-$C$55)*(SUM('Irr Peanuts'!$D$27:$D$28)))/$C53","v":{"v":677.1596110450454,"d":"$677.16"}},{"$f":"IF($D53=0, \"N/A\", ('Irr Peanuts'!$H$65+($D53-$D$55)*(SUM('Irr Peanuts'!$D$27:$D$28)))/$D53)","v":{"v":270.385143270385,"d":"$270.39"}}]
[{"v":0.9,"d":"90%"},{"$f":"'Irr Peanuts'!$B$9*$A54","v":{"v":2.025,"d":"2.03"}},{"$f":"'Irr Peanuts'!$B$9*(1-'Irr Peanuts'!$E$9)*$A54","v":{"v":1.35675,"d":"1.36"}},{"$f":"'Irr Peanuts'!$B$9*'Irr Peanuts'!$E$9*$A54","v":{"v":0.66825,"d":"0.67"}},{"$f":"('Irr Peanuts'!$F$51+($B54-$B$55)*(SUM('Irr Peanuts'!$D$27:$D$28)))/$B54","v":{"v":358.9862656585594,"d":"$358.99"}},{"$f":"('Irr Peanuts'!$G$51+($C54-$C$55)*(SUM('Irr Peanuts'!$D$27:$D$28)))/$C54","v":{"v":474.77553730444396,"d":"$474.78"}},{"$f":"('Irr Peanuts'!$F$65+($B54-$B$55)*(SUM('Irr Peanuts'!$D$27:$D$28)))/$B54","v":{"v":461.78132738695444,"d":"$461.78"}},{"$f":"('Irr Peanuts'!$G$65+($C54-$C$55)*(SUM('Irr Peanuts'!$D$27:$D$28)))/$C54","v":{"v":575.1330092042044,"d":"$575.13"}},{"$f":"IF($D54=0, \"N/A\", ('Irr Peanuts'!$H$65+($D54-$D$55)*(SUM('Irr Peanuts'!$D$27:$D$28)))/$D54)","v":{"v":236.15428605865418,"d":"$236.15"}}]
[{"v":1,"d":"100%"},{"$f":"'Irr Peanuts'!$B$9*$A55","v":2.25},{"$f":"'Irr Peanuts'!$B$9*(1-'Irr Peanuts'!$E$9)*$A55","v":{"v":1.5074999999999998,"d":"1.51"}},{"$f":"'Irr Peanuts'!$B$9*'Irr Peanuts'!$E$9*$A55","v":{"v":0.7425,"d":"0.74"}},{"$f":"('Irr Peanuts'!$F$51+($B55-$B$55)*(SUM('Irr Peanuts'!$D$27:$D$28)))/$B55","v":{"v":329.58763909270345,"d":"$329.59"}},{"$f":"('Irr Peanuts'!$G$51+($C55-$C$55)*(SUM('Irr Peanuts'!$D$27:$D$28)))/$C55","v":{"v":433.7979835739996,"d":"$433.80"}},{"$f":"('Irr Peanuts'!$F$65+($B55-$B$55)*(SUM('Irr Peanuts'!$D$27:$D$28)))/$B55","v":{"v":422.103194648259,"d":"$422.10"}},{"$f":"('Irr Peanuts'!$G$65+($C55-$C$55)*(SUM('Irr Peanuts'!$D$27:$D$28)))/$C55","v":{"v":524.119708283784,"d":"$524.12"}},{"$f":"IF($D55=0, \"N/A\", ('Irr Peanuts'!$H$65+($D55-$D$55)*(SUM('Irr Peanuts'!$D$27:$D$28)))/$D55)","v":{"v":219.03885745278876,"d":"$219.04"}}]
[{"v":1.1,"d":"110%"},{"$f":"'Irr Peanuts'!$B$9*$A56","v":{"v":2.475,"d":"2.48"}},{"$f":"'Irr Peanuts'!$B$9*(1-'Irr Peanuts'!$E$9)*$A56","v":{"v":1.65825,"d":"1.66"}},{"$f":"'Irr Peanuts'!$B$9*'Irr Peanuts'!$E$9*$A56","v":{"v":0.8167500000000001,"d":"0.82"}},{"$f":"('Irr Peanuts'!$F$51+($B56-$B$55)*(SUM('Irr Peanuts'!$D$27:$D$28)))/$B56","v":{"v":305.5342173570031,"d":"$305.53"}},{"$f":"('Irr Peanuts'!$G$51+($C56-$C$55)*(SUM('Irr Peanuts'!$D$27:$D$28)))/$C56","v":{"v":400.2708941581815,"d":"$400.27"}},{"$f":"('Irr Peanuts'!$F$65+($B56-$B$55)*(SUM('Irr Peanuts'!$D$27:$D$28)))/$B56","v":{"v":389.6392678620536,"d":"$389.64"}},{"$f":"('Irr Peanuts'!$G$65+($C56-$C$55)*(SUM('Irr Peanuts'!$D$27:$D$28)))/$C56","v":{"v":482.38155298525817,"d":"$482.38"}},{"$f":"IF($D56=0, \"N/A\", ('Irr Peanuts'!$H$65+($D56-$D$55)*(SUM('Irr Peanuts'!$D$27:$D$28)))/$D56)","v":{"v":205.03532495708072,"d":"$205.04"}}]
[{"v":1.25,"d":"125%"},{"$f":"'Irr Peanuts'!$B$9*$A57","v":{"v":2.8125,"d":"2.81"}},{"$f":"'Irr Peanuts'!$B$9*(1-'Irr Peanuts'!$E$9)*$A57","v":{"v":1.884375,"d":"1.88"}},{"$f":"'Irr Peanuts'!$B$9*'Irr Peanuts'!$E$9*$A57","v":{"v":0.9281250000000001,"d":"0.93"}},{"$f":"('Irr Peanuts'!$F$51+($B57-$B$55)*(SUM('Irr Peanuts'!$D$27:$D$28)))/$B57","v":{"v":276.67011127416276,"d":"$276.67"}},{"$f":"('Irr Peanuts'!$G$51+($C57-$C$55)*(SUM('Irr Peanuts'!$D$27:$D$28)))/$C57","v":{"v":360.0383868591997,"d":"$360.04"}},{"$f":"('Irr Peanuts'!$F$65+($B57-$B$55)*(SUM('Irr Peanuts'!$D$27:$D$28)))/$B57","v":{"v":350.6825557186072,"d":"$350.68"}},{"$f":"('Irr Peanuts'!$G$65+($C57-$C$55)*(SUM('Irr Peanuts'!$D$27:$D$28)))/$C57","v":{"v":432.2957666270272,"d":"$432.30"}},{"$f":"IF($D57=0, \"N/A\", ('Irr Peanuts'!$H$65+($D57-$D$55)*(SUM('Irr Peanuts'!$D$27:$D$28)))/$D57)","v":{"v":188.23108596223102,"d":"$188.23"}}]
[]
[{"$f":"'Irr Sorghum'!A3:H3","v":"Irrigated Sorghum"}]
[{"$nulls":4},"BE Price to Cover Variable Costs",null,"BE Price to Cover Total Costs"]
["Yield","CWT",null,null,"Total","Tenant","Total","Tenant","Landlord"]
[{"v":0.75,"d":"75%"},{"$f":"'Irr Sorghum'!$B$9*$A62","v":{"v":45,"d":"45.00"}},{"$f":"'Irr Sorghum'!$B$9*(1-'Irr Sorghum'!$E$9)*$A62","v":30.15},{"$f":"'Irr Sorghum'!$B$9*'Irr Sorghum'!$E$9*$A62","v":{"v":14.850000000000001,"d":"14.85"}},{"$f":"('Irr Sorghum'!$F$46-'Irr Sorghum'!$F$10+($B62-$B$64)*'Irr Sorghum'!$D$24)/$B62","v":{"v":7.224022619018872,"d":"$7.22"}},{"$f":"('Irr Sorghum'!$G$46-'Irr Sorghum'!$F$10+($C62-$C$64)*'Irr Sorghum'!$D$24)/$C62","v":{"v":8.867408613077913,"d":"$8.87"}},{"$f":"('Irr Sorghum'!$F$60-'Irr Sorghum'!$F$10+($B62-$B$64)*'Irr Sorghum'!$D$24)/$B62","v":{"v":11.216689285685542,"d":"$11.22"}},{"$f":"('Irr Sorghum'!$G$60-'Irr Sorghum'!$F$10+($C62-$C$64)*'Irr Sorghum'!$D$24)/$C62","v":{"v":12.438552891684878,"d":"$12.44"}},{"$f":"IF($D62=0, \"N/A\", ('Irr Sorghum'!$H$60-'Irr Sorghum'!$F$10+($D62-$D$64)*'Irr Sorghum'!$D$24)/$D62)","v":{"v":8.838032799179292,"d":"$8.84"}}]
[{"v":0.9,"d":"90%"},{"$f":"'Irr Sorghum'!$B$9*$A63","v":{"v":54,"d":"54.00"}},{"$f":"'Irr Sorghum'!$B$9*(1-'Irr Sorghum'!$E$9)*$A63","v":36.18},{"$f":"'Irr Sorghum'!$B$9*'Irr Sorghum'!$E$9*$A63","v":17.82},{"$f":"('Irr Sorghum'!$F$46-'Irr Sorghum'!$F$10+($B63-$B$64)*'Irr Sorghum'!$D$24)/$B63","v":{"v":6.16168551584906,"d":"$6.16"}},{"$f":"('Irr Sorghum'!$G$46-'Irr Sorghum'!$F$10+($C63-$C$64)*'Irr Sorghum'!$D$24)/$C63","v":{"v":7.531173844231595,"d":"$7.53"}},{"$f":"('Irr Sorghum'!$F$60-'Irr Sorghum'!$F$10+($B63-$B$64)*'Irr Sorghum'!$D$24)/$B63","v":{"v":9.488907738071283,"d":"$9.49"}},{"$f":"('Irr Sorghum'!$G$60-'Irr Sorghum'!$F$10+($C63-$C$64)*'Irr Sorghum'!$D$24)/$C63","v":{"v":10.5071274097374,"d":"$10.51"}},{"$f":"IF($D63=0, \"N/A\", ('Irr Sorghum'!$H$60-'Irr Sorghum'!$F$10+($D63-$D$64)*'Irr Sorghum'!$D$24)/$D63)","v":{"v":7.506693999316078,"d":"$7.51"}}]
[{"v":1,"d":"100%"},{"$f":"'Irr Sorghum'!$B$9*$A64","v":{"v":60,"d":"60.00"}},{"$f":"'Irr Sorghum'!$B$9*(1-'Irr Sorghum'!$E$9)*$A64","v":{"v":40.199999999999996,"d":"40.20"}},{"$f":"'Irr Sorghum'!$B$9*'Irr Sorghum'!$E$9*$A64","v":{"v":19.8,"d":"19.80"}},{"$f":"('Irr Sorghum'!$F$46-'Irr Sorghum'!$F$10+($B64-$B$64)*'Irr Sorghum'!$D$24)/$B64","v":{"v":5.630516964264155,"d":"$5.63"}},{"$f":"('Irr Sorghum'!$G$46-'Irr Sorghum'!$F$10+($C64-$C$64)*'Irr Sorghum'!$D$24)/$C64","v":{"v":6.863056459808435,"d":"$6.86"}},{"$f":"('Irr Sorghum'!$F$60-'Irr Sorghum'!$F$10+($B64-$B$64)*'Irr Sorghum'!$D$24)/$B64","v":{"v":8.625016964264155,"d":"$8.63"}},{"$f":"('Irr Sorghum'!$G$60-'Irr Sorghum'!$F$10+($C64-$C$64)*'Irr Sorghum'!$D$24)/$C64","v":{"v":9.54141466876366,"d":"$9.54"}},{"$f":"IF($D64=0, \"N/A\", ('Irr Sorghum'!$H$60-'Irr Sorghum'!$F$10+($D64-$D$64)*'Irr Sorghum'!$D$24)/$D64)","v":{"v":6.84102459938447,"d":"$6.84"}}]
[{"v":1.1,"d":"110%"},{"$f":"'Irr Sorghum'!$B$9*$A65","v":{"v":66,"d":"66.00"}},{"$f":"'Irr Sorghum'!$B$9*(1-'Irr Sorghum'!$E$9)*$A65","v":44.22},{"$f":"'Irr Sorghum'!$B$9*'Irr Sorghum'!$E$9*$A65","v":21.78},{"$f":"('Irr Sorghum'!$F$46-'Irr Sorghum'!$F$10+($B65-$B$64)*'Irr Sorghum'!$D$24)/$B65","v":{"v":5.195924512967413,"d":"$5.20"}},{"$f":"('Irr Sorghum'!$G$46-'Irr Sorghum'!$F$10+($C65-$C$64)*'Irr Sorghum'!$D$24)/$C65","v":{"v":6.316414963462214,"d":"$6.32"}},{"$f":"('Irr Sorghum'!$F$60-'Irr Sorghum'!$F$10+($B65-$B$64)*'Irr Sorghum'!$D$24)/$B65","v":{"v":7.918197240240142,"d":"$7.92"}},{"$f":"('Irr Sorghum'!$G$60-'Irr Sorghum'!$F$10+($C65-$C$64)*'Irr Sorghum'!$D$24)/$C65","v":{"v":8.751286062512419,"d":"$8.75"}},{"$f":"IF($D65=0, \"N/A\", ('Irr Sorghum'!$H$60-'Irr Sorghum'!$F$10+($D65-$D$64)*'Irr Sorghum'!$D$24)/$D65)","v":{"v":6.296385999440426,"d":"$6.30"}}]
[{"v":1.25,"d":"125%"},{"$f":"'Irr Sorghum'!$B$9*$A66","v":{"v":75,"d":"75.00"}},{"$f":"'Irr Sorghum'!$B$9*(1-'Irr Sorghum'!$E$9)*$A66","v":{"v":50.24999999999999,"d":"50.25"}},{"$f":"'Irr Sorghum'!$B$9*'Irr Sorghum'!$E$9*$A66","v":24.75},{"$f":"('Irr Sorghum'!$F$46-'Irr Sorghum'!$F$10+($B66-$B$64)*'Irr Sorghum'!$D$24)/$B66","v":{"v":4.674413571411324,"d":"$4.67"}},{"$f":"('Irr Sorghum'!$G$46-'Irr Sorghum'!$F$10+($C66-$C$64)*'Irr Sorghum'!$D$24)/$C66","v":{"v":5.660445167846749,"d":"$5.66"}},{"$f":"('Irr Sorghum'!$F$60-'Irr Sorghum'!$F$10+($B66-$B$64)*'Irr Sorghum'!$D$24)/$B66","v":{"v":7.070013571411325,"d":"$7.07"}},{"$f":"('Irr Sorghum'!$G$60-'Irr Sorghum'!$F$10+($C66-$C$64)*'Irr Sorghum'!$D$24)/$C66","v":{"v":7.803131735010928,"d":"$7.80"}},{"$f":"IF($D66=0, \"N/A\", ('Irr Sorghum'!$H$60-'Irr Sorghum'!$F$10+($D66-$D$64)*'Irr Sorghum'!$D$24)/$D66)","v":{"v":5.642819679507577,"d":"$5.64"}}]
[]
[{"$f":"'Irr Sorghum Seed'!A3:H3","v":"Irrigated Sorghum Seed "}]
[{"$nulls":4},"BE Price to Cover Variable Costs",null,"BE Price to Cover Total Costs"]
["Yield","CWT",null,null,"Total","Tenant","Total","Tenant","Landlord"]
[{"v":0.75,"d":"75%"},{"$f":"'Irr Sorghum Seed'!$B$9*$A71","v":33.75},{"$f":"'Irr Sorghum Seed'!$B$9*(1-'Irr Sorghum Seed'!$E$9)*$A71","v":{"v":22.612499999999997,"d":"22.61"}},{"$f":"'Irr Sorghum Seed'!$B$9*'Irr Sorghum Seed'!$E$9*$A71","v":{"v":11.137500000000001,"d":"11.14"}},{"$f":"('Irr Sorghum Seed'!$F$46-'Irr Sorghum'!$F$10+($B71-$B$73)*'Irr Sorghum Seed'!$D$24)/$B71","v":{"v":10.893444822153846,"d":"$10.89"}},{"$f":"('Irr Sorghum Seed'!$G$46-'Irr Sorghum'!$F$10+($C71-$C$73)*'Irr Sorghum Seed'!$D$24)/$C71","v":{"v":13.191195676318408,"d":"$13.19"}},{"$f":"('Irr Sorghum Seed'!$F$60-'Irr Sorghum'!$F$10+($B71-$B$73)*'Irr Sorghum Seed'!$D$24)/$B71","v":{"v":15.927222599931625,"d":"$15.93"}},{"$f":"('Irr Sorghum Seed'!$G$60-'Irr Sorghum'!$F$10+($C71-$C$73)*'Irr Sorghum Seed'!$D$24)/$C71","v":{"v":17.520217235190714,"d":"$17.52"}},{"$f":"IF($D71=0, \"N/A\", ('Irr Sorghum Seed'!$H$60-'Irr Sorghum'!$F$10+($D71-$D$73)*'Irr Sorghum Seed'!$D$24)/$D71)","v":{"v":12.878733875757577,"d":"$12.88"}}]
[{"v":0.9,"d":"90%"},{"$f":"'Irr Sorghum Seed'!$B$9*$A72","v":{"v":40.5,"d":"40.50"}},{"$f":"'Irr Sorghum Seed'!$B$9*(1-'Irr Sorghum Seed'!$E$9)*$A72","v":{"v":27.134999999999998,"d":"27.14"}},{"$f":"'Irr Sorghum Seed'!$B$9*'Irr Sorghum Seed'!$E$9*$A72","v":{"v":13.365000000000002,"d":"13.37"}},{"$f":"('Irr Sorghum Seed'!$F$46-'Irr Sorghum'!$F$10+($B72-$B$73)*'Irr Sorghum Seed'!$D$24)/$B72","v":{"v":9.219537351794873,"d":"$9.22"}},{"$f":"('Irr Sorghum Seed'!$G$46-'Irr Sorghum'!$F$10+($C72-$C$73)*'Irr Sorghum Seed'!$D$24)/$C72","v":{"v":11.134329730265339,"d":"$11.13"}},{"$f":"('Irr Sorghum Seed'!$F$60-'Irr Sorghum'!$F$10+($B72-$B$73)*'Irr Sorghum Seed'!$D$24)/$B72","v":{"v":13.414352166609685,"d":"$13.41"}},{"$f":"('Irr Sorghum Seed'!$G$60-'Irr Sorghum'!$F$10+($C72-$C$73)*'Irr Sorghum Seed'!$D$24)/$C72","v":{"v":14.74184769599226,"d":"$14.74"}},{"$f":"IF($D72=0, \"N/A\", ('Irr Sorghum Seed'!$H$60-'Irr Sorghum'!$F$10+($D72-$D$73)*'Irr Sorghum Seed'!$D$24)/$D72)","v":{"v":10.873944896464646,"d":"$10.87"}}]
[{"v":1,"d":"100%"},{"$f":"'Irr Sorghum Seed'!$B$9*$A73","v":{"v":45,"d":"45.00"}},{"$f":"'Irr Sorghum Seed'!$B$9*(1-'Irr Sorghum Seed'!$E$9)*$A73","v":30.15},{"$f":"'Irr Sorghum Seed'!$B$9*'Irr Sorghum Seed'!$E$9*$A73","v":{"v":14.850000000000001,"d":"14.85"}},{"$f":"('Irr Sorghum Seed'!$F$46-'Irr Sorghum'!$F$10+($B73-$B$73)*'Irr Sorghum Seed'!$D$24)/$B73","v":{"v":8.382583616615385,"d":"$8.38"}},{"$f":"('Irr Sorghum Seed'!$G$46-'Irr Sorghum'!$F$10+($C73-$C$73)*'Irr Sorghum Seed'!$D$24)/$C73","v":{"v":10.105896757238805,"d":"$10.11"}},{"$f":"('Irr Sorghum Seed'!$F$60-'Irr Sorghum'!$F$10+($B73-$B$73)*'Irr Sorghum Seed'!$D$24)/$B73","v":{"v":12.157916949948717,"d":"$12.16"}},{"$f":"('Irr Sorghum Seed'!$G$60-'Irr Sorghum'!$F$10+($C73-$C$73)*'Irr Sorghum Seed'!$D$24)/$C73","v":{"v":13.352662926393034,"d":"$13.35"}},{"$f":"IF($D73=0, \"N/A\", ('Irr Sorghum Seed'!$H$60-'Irr Sorghum'!$F$10+($D73-$D$73)*'Irr Sorghum Seed'!$D$24)/$D73)","v":{"v":9.871550406818182,"d":"$9.87"}}]
[{"v":1.1,"d":"110%"},{"$f":"'Irr Sorghum Seed'!$B$9*$A74","v":{"v":49.50000000000001,"d":"49.50"}},{"$f":"'Irr Sorghum Seed'!$B$9*(1-'Irr Sorghum Seed'!$E$9)*$A74","v":{"v":33.165,"d":"33.17"}},{"$f":"'Irr Sorghum Seed'!$B$9*'Irr Sorghum Seed'!$E$9*$A74","v":{"v":16.335000000000004,"d":"16.34"}},{"$f":"('Irr Sorghum Seed'!$F$46-'Irr Sorghum'!$F$10+($B74-$B$73)*'Irr Sorghum Seed'!$D$24)/$B74","v":{"v":7.6978032878321665,"d":"$7.70"}},{"$f":"('Irr Sorghum Seed'!$G$46-'Irr Sorghum'!$F$10+($C74-$C$73)*'Irr Sorghum Seed'!$D$24)/$C74","v":{"v":9.264451597489822,"d":"$9.26"}},{"$f":"('Irr Sorghum Seed'!$F$60-'Irr Sorghum'!$F$10+($B74-$B$73)*'Irr Sorghum Seed'!$D$24)/$B74","v":{"v":11.129924499953379,"d":"$11.13"}},{"$f":"('Irr Sorghum Seed'!$G$60-'Irr Sorghum'!$F$10+($C74-$C$73)*'Irr Sorghum Seed'!$D$24)/$C74","v":{"v":12.216057205811849,"d":"$12.22"}},{"$f":"IF($D74=0, \"N/A\", ('Irr Sorghum Seed'!$H$60-'Irr Sorghum'!$F$10+($D74-$D$73)*'Irr Sorghum Seed'!$D$24)/$D74)","v":{"v":9.0514094607438,"d":"$9.05"}}]
[{"v":1.25,"d":"125%"},{"$f":"'Irr Sorghum Seed'!$B$9*$A75","v":56.25},{"$f":"'Irr Sorghum Seed'!$B$9*(1-'Irr Sorghum Seed'!$E$9)*$A75","v":{"v":37.6875,"d":"37.69"}},{"$f":"'Irr Sorghum Seed'!$B$9*'Irr Sorghum Seed'!$E$9*$A75","v":{"v":18.5625,"d":"18.56"}},{"$f":"('Irr Sorghum Seed'!$F$46-'Irr Sorghum'!$F$10+($B75-$B$73)*'Irr Sorghum Seed'!$D$24)/$B75","v":{"v":6.876066893292308,"d":"$6.88"}},{"$f":"('Irr Sorghum Seed'!$G$46-'Irr Sorghum'!$F$10+($C75-$C$73)*'Irr Sorghum Seed'!$D$24)/$C75","v":{"v":8.254717405791045,"d":"$8.25"}},{"$f":"('Irr Sorghum Seed'!$F$60-'Irr Sorghum'!$F$10+($B75-$B$73)*'Irr Sorghum Seed'!$D$24)/$B75","v":{"v":9.896333559958974,"d":"$9.90"}},{"$f":"('Irr Sorghum Seed'!$G$60-'Irr Sorghum'!$F$10+($C75-$C$73)*'Irr Sorghum Seed'!$D$24)/$C75","v":{"v":10.852130341114426,"d":"$10.85"}},{"$f":"IF($D75=0, \"N/A\", ('Irr Sorghum Seed'!$H$60-'Irr Sorghum'!$F$10+($D75-$D$73)*'Irr Sorghum Seed'!$D$24)/$D75)","v":{"v":8.067240325454545,"d":"$8.07"}}]
[]
[{"$f":"'Irr Sorghum Silage'!A3:H3","v":"Irrigated Sorghum Silage"}]
[{"$nulls":4},"BE Price to Cover Variable Costs",null,"BE Price to Cover Total Costs"]
["Yield","TON",null,null,"Total","Tenant","Total","Tenant","Landlord"]
[{"v":0.75,"d":"75%"},{"$f":"'Irr Sorghum Silage'!$B$9*$A80","v":15.75},{"$f":"'Irr Sorghum Silage'!$B$9*(1-'Irr Sorghum Silage'!$E$9)*$A80","v":{"v":10.552499999999998,"d":"10.55"}},{"$f":"'Irr Sorghum Silage'!$B$9*'Irr Sorghum Silage'!$E$9*$A80","v":{"v":5.197500000000001,"d":"5.20"}},{"$f":"('Irr Sorghum Silage'!F$46+(B80-B$82)*('Irr Sorghum Silage'!$D$24))/B80","v":{"v":29.222351848492988,"d":"$29.22"}},{"$f":"('Irr Sorghum Silage'!G$46+(C80-C$82)*('Irr Sorghum Silage'!$D$24))/C80","v":{"v":38.821238005525174,"d":"$38.82"}},{"$f":"('Irr Sorghum Silage'!F$60+(B80-B$82)*('Irr Sorghum Silage'!$D$24))/B80","v":{"v":39.80012962627077,"d":"$39.80"}},{"$f":"('Irr Sorghum Silage'!G$60+(C80-C$82)*('Irr Sorghum Silage'!$D$24))/C80","v":{"v":47.78593831350906,"d":"$47.79"}},{"$f":"IF($D80=0,\"N/A\",('Irr Sorghum Silage'!H$60+(D80-D$82)*('Irr Sorghum Silage'!$D$24))/D80)","v":{"v":23.85620933852814,"d":"$23.86"}}]
[{"v":0.9,"d":"90%"},{"$f":"'Irr Sorghum Silage'!$B$9*$A81","v":{"v":18.900000000000002,"d":"18.90"}},{"$f":"'Irr Sorghum Silage'!$B$9*(1-'Irr Sorghum Silage'!$E$9)*$A81","v":{"v":12.662999999999998,"d":"12.66"}},{"$f":"'Irr Sorghum Silage'!$B$9*'Irr Sorghum Silage'!$E$9*$A81","v":{"v":6.237000000000001,"d":"6.24"}},{"$f":"('Irr Sorghum Silage'!F$46+(B81-B$82)*('Irr Sorghum Silage'!$D$24))/B81","v":{"v":25.851959873744153,"d":"$25.85"}},{"$f":"('Irr Sorghum Silage'!G$46+(C81-C$82)*('Irr Sorghum Silage'!$D$24))/C81","v":{"v":33.851031671270974,"d":"$33.85"}},{"$f":"('Irr Sorghum Silage'!F$60+(B81-B$82)*('Irr Sorghum Silage'!$D$24))/B81","v":{"v":34.66677468855897,"d":"$34.67"}},{"$f":"('Irr Sorghum Silage'!G$60+(C81-C$82)*('Irr Sorghum Silage'!$D$24))/C81","v":{"v":41.32161526125755,"d":"$41.32"}},{"$f":"IF($D81=0,\"N/A\",('Irr Sorghum Silage'!H$60+(D81-D$82)*('Irr Sorghum Silage'!$D$24))/D81)","v":{"v":21.38017444877345,"d":"$21.38"}}]
[{"v":1,"d":"100%"},{"$f":"'Irr Sorghum Silage'!$B$9*$A82","v":{"v":21,"d":"21.00"}},{"$f":"'Irr Sorghum Silage'!$B$9*(1-'Irr Sorghum Silage'!$E$9)*$A82","v":{"v":14.069999999999999,"d":"14.07"}},{"$f":"'Irr Sorghum Silage'!$B$9*'Irr Sorghum Silage'!$E$9*$A82","v":{"v":6.930000000000001,"d":"6.93"}},{"$f":"('Irr Sorghum Silage'!F$46+(B82-B$82)*('Irr Sorghum Silage'!$D$24))/B82","v":{"v":24.16676388636974,"d":"$24.17"}},{"$f":"('Irr Sorghum Silage'!G$46+(C82-C$82)*('Irr Sorghum Silage'!$D$24))/C82","v":{"v":31.365928504143877,"d":"$31.37"}},{"$f":"('Irr Sorghum Silage'!F$60+(B82-B$82)*('Irr Sorghum Silage'!$D$24))/B82","v":{"v":32.10009721970307,"d":"$32.10"}},{"$f":"('Irr Sorghum Silage'!G$60+(C82-C$82)*('Irr Sorghum Silage'!$D$24))/C82","v":{"v":38.08945373513179,"d":"$38.09"}},{"$f":"IF($D82=0,\"N/A\",('Irr Sorghum Silage'!H$60+(D82-D$82)*('Irr Sorghum Silage'!$D$24))/D82)","v":{"v":20.142157003896102,"d":"$20.14"}}]
[{"v":1.1,"d":"110%"},{"$f":"'Irr Sorghum Silage'!$B$9*$A83","v":{"v":23.1,"d":"23.10"}},{"$f":"'Irr Sorghum Silage'!$B$9*(1-'Irr Sorghum Silage'!$E$9)*$A83","v":{"v":15.477,"d":"15.48"}},{"$f":"'Irr Sorghum Silage'!$B$9*'Irr Sorghum Silage'!$E$9*$A83","v":{"v":7.623000000000001,"d":"7.62"}},{"$f":"('Irr Sorghum Silage'!F$46+(B83-B$82)*('Irr Sorghum Silage'!$D$24))/B83","v":{"v":22.787967169427038,"d":"$22.79"}},{"$f":"('Irr Sorghum Silage'!G$46+(C83-C$82)*('Irr Sorghum Silage'!$D$24))/C83","v":{"v":29.332662276494432,"d":"$29.33"}},{"$f":"('Irr Sorghum Silage'!F$60+(B83-B$82)*('Irr Sorghum Silage'!$D$24))/B83","v":{"v":30.000088381548245,"d":"$30.00"}},{"$f":"('Irr Sorghum Silage'!G$60+(C83-C$82)*('Irr Sorghum Silage'!$D$24))/C83","v":{"v":35.4449579410289,"d":"$35.44"}},{"$f":"IF($D83=0,\"N/A\",('Irr Sorghum Silage'!H$60+(D83-D$82)*('Irr Sorghum Silage'!$D$24))/D83)","v":{"v":19.129233639905546,"d":"$19.13"}}]
[{"v":1.25,"d":"125%"},{"$f":"'Irr Sorghum Silage'!$B$9*$A84","v":26.25},{"$f":"'Irr Sorghum Silage'!$B$9*(1-'Irr Sorghum Silage'!$E$9)*$A84","v":{"v":17.5875,"d":"17.59"}},{"$f":"'Irr Sorghum Silage'!$B$9*'Irr Sorghum Silage'!$E$9*$A84","v":{"v":8.662500000000001,"d":"8.66"}},{"$f":"('Irr Sorghum Silage'!F$46+(B84-B$82)*('Irr Sorghum Silage'!$D$24))/B84","v":{"v":21.13341110909579,"d":"$21.13"}},{"$f":"('Irr Sorghum Silage'!G$46+(C84-C$82)*('Irr Sorghum Silage'!$D$24))/C84","v":{"v":26.8927428033151,"d":"$26.89"}},{"$f":"('Irr Sorghum Silage'!F$60+(B84-B$82)*('Irr Sorghum Silage'!$D$24))/B84","v":{"v":27.480077775762457,"d":"$27.48"}},{"$f":"('Irr Sorghum Silage'!G$60+(C84-C$82)*('Irr Sorghum Silage'!$D$24))/C84","v":{"v":32.27156298810544,"d":"$32.27"}},{"$f":"IF($D84=0,\"N/A\",('Irr Sorghum Silage'!H$60+(D84-D$82)*('Irr Sorghum Silage'!$D$24))/D84)","v":{"v":17.91372560311688,"d":"$17.91"}}]
[]
[{"$f":"'Irr Sorghum Sudangrass'!A3:H3","v":"Irrigated Sorghum Sudangrass"}]
[{"$nulls":4},"BE Price to Cover Variable Costs",null,"BE Price to Cover Total Costs"]
["Yield","LB",null,null,"Total","Tenant","Total","Tenant","Landlord"]
[{"v":0.75,"d":"75%"},{"$f":"'Irr Sorghum Sudangrass'!$B$9*$A89","v":{"v":600,"d":"600.00"}},{"$f":"'Irr Sorghum Sudangrass'!$B$9*(1-'Irr Sorghum Sudangrass'!$E$9)*$A89","v":{"v":402,"d":"402.00"}},{"$f":"'Irr Sorghum Sudangrass'!$B$9*'Irr Sorghum Sudangrass'!$E$9*$A89","v":{"v":198,"d":"198.00"}},{"$f":"('Irr Sorghum Sudangrass'!F$46+(B89-B$91)*('Irr Sorghum Sudangrass'!$D$24))/B89","v":{"v":0.42363000639063153,"d":"$0.42"}},{"$f":"('Irr Sorghum Sudangrass'!G$46+(C89-C$91)*('Irr Sorghum Sudangrass'!$D$24))/C89","v":{"v":0.5116860599215423,"d":"$0.51"}},{"$f":"('Irr Sorghum Sudangrass'!F$60+(B89-B$91)*('Irr Sorghum Sudangrass'!$D$24))/B89","v":{"v":0.6836633397239649,"d":"$0.68"}},{"$f":"('Irr Sorghum Sudangrass'!G$60+(C89-C$91)*('Irr Sorghum Sudangrass'!$D$24))/C89","v":{"v":0.7206910350459204,"d":"$0.72"}},{"$f":"IF($D89=0,\"N/A\",('Irr Sorghum Sudangrass'!H$60+(D89-D$91)*('Irr Sorghum Sudangrass'!$D$24))/D89)","v":{"v":0.6169630303030303,"d":"$0.62"}}]
[{"v":0.9,"d":"90%"},{"$f":"'Irr Sorghum Sudangrass'!$B$9*$A90","v":{"v":720,"d":"720.00"}},{"$f":"'Irr Sorghum Sudangrass'!$B$9*(1-'Irr Sorghum Sudangrass'!$E$9)*$A90","v":{"v":482.40000000000003,"d":"482.40"}},{"$f":"'Irr Sorghum Sudangrass'!$B$9*'Irr Sorghum Sudangrass'!$E$9*$A90","v":{"v":237.6,"d":"237.60"}},{"$f":"('Irr Sorghum Sudangrass'!F$46+(B90-B$91)*('Irr Sorghum Sudangrass'!$D$24))/B90","v":{"v":0.3530250053255263,"d":"$0.35"}},{"$f":"('Irr Sorghum Sudangrass'!G$46+(C90-C$91)*('Irr Sorghum Sudangrass'!$D$24))/C90","v":{"v":0.4264050499346185,"d":"$0.43"}},{"$f":"('Irr Sorghum Sudangrass'!F$60+(B90-B$91)*('Irr Sorghum Sudangrass'!$D$24))/B90","v":{"v":0.5697194497699708,"d":"$0.57"}},{"$f":"('Irr Sorghum Sudangrass'!G$60+(C90-C$91)*('Irr Sorghum Sudangrass'!$D$24))/C90","v":{"v":0.6005758625382669,"d":"$0.60"}},{"$f":"IF($D90=0,\"N/A\",('Irr Sorghum Sudangrass'!H$60+(D90-D$91)*('Irr Sorghum Sudangrass'!$D$24))/D90)","v":{"v":0.5141358585858586,"d":"$0.51"}}]
[{"v":1,"d":"100%"},{"$f":"'Irr Sorghum Sudangrass'!$B$9*$A91","v":{"v":800,"d":"800.00"}},{"$f":"'Irr Sorghum Sudangrass'!$B$9*(1-'Irr Sorghum Sudangrass'!$E$9)*$A91","v":{"v":536,"d":"536.00"}},{"$f":"'Irr Sorghum Sudangrass'!$B$9*'Irr Sorghum Sudangrass'!$E$9*$A91","v":{"v":264,"d":"264.00"}},{"$f":"('Irr Sorghum Sudangrass'!F$46+(B91-B$91)*('Irr Sorghum Sudangrass'!$D$24))/B91","v":{"v":0.31772250479297365,"d":"$0.32"}},{"$f":"('Irr Sorghum Sudangrass'!G$46+(C91-C$91)*('Irr Sorghum Sudangrass'!$D$24))/C91","v":{"v":0.38376454494115664,"d":"$0.38"}},{"$f":"('Irr Sorghum Sudangrass'!F$60+(B91-B$91)*('Irr Sorghum Sudangrass'!$D$24))/B91","v":{"v":0.5127475047929737,"d":"$0.51"}},{"$f":"('Irr Sorghum Sudangrass'!G$60+(C91-C$91)*('Irr Sorghum Sudangrass'!$D$24))/C91","v":{"v":0.5405182762844403,"d":"$0.54"}},{"$f":"IF($D91=0,\"N/A\",('Irr Sorghum Sudangrass'!H$60+(D91-D$91)*('Irr Sorghum Sudangrass'!$D$24))/D91)","v":{"v":0.46272227272727273,"d":"$0.46"}}]
[{"v":1.1,"d":"110%"},{"$f":"'Irr Sorghum Sudangrass'!$B$9*$A92","v":{"v":880.0000000000001,"d":"880.00"}},{"$f":"'Irr Sorghum Sudangrass'!$B$9*(1-'Irr Sorghum Sudangrass'!$E$9)*$A92","v":{"v":589.6,"d":"589.60"}},{"$f":"'Irr Sorghum Sudangrass'!$B$9*'Irr Sorghum Sudangrass'!$E$9*$A92","v":{"v":290.40000000000003,"d":"290.40"}},{"$f":"('Irr Sorghum Sudangrass'!F$46+(B92-B$91)*('Irr Sorghum Sudangrass'!$D$24))/B92","v":{"v":0.2888386407208851,"d":"$0.29"}},{"$f":"('Irr Sorghum Sudangrass'!G$46+(C92-C$91)*('Irr Sorghum Sudangrass'!$D$24))/C92","v":{"v":0.3488768590374151,"d":"$0.35"}},{"$f":"('Irr Sorghum Sudangrass'!F$60+(B92-B$91)*('Irr Sorghum Sudangrass'!$D$24))/B92","v":{"v":0.46613409526633964,"d":"$0.47"}},{"$f":"('Irr Sorghum Sudangrass'!G$60+(C92-C$91)*('Irr Sorghum Sudangrass'!$D$24))/C92","v":{"v":0.4913802511676729,"d":"$0.49"}},{"$f":"IF($D92=0,\"N/A\",('Irr Sorghum Sudangrass'!H$60+(D92-D$91)*('Irr Sorghum Sudangrass'!$D$24))/D92)","v":{"v":0.4206566115702479,"d":"$0.42"}}]
[{"v":1.25,"d":"125%"},{"$f":"'Irr Sorghum Sudangrass'!$B$9*$A93","v":{"v":1000,"d":"1000.00"}},{"$f":"'Irr Sorghum Sudangrass'!$B$9*(1-'Irr Sorghum Sudangrass'!$E$9)*$A93","v":{"v":670,"d":"670.00"}},{"$f":"'Irr Sorghum Sudangrass'!$B$9*'Irr Sorghum Sudangrass'!$E$9*$A93","v":{"v":330,"d":"330.00"}},{"$f":"('Irr Sorghum Sudangrass'!F$46+(B93-B$91)*('Irr Sorghum Sudangrass'!$D$24))/B93","v":{"v":0.25417800383437894,"d":"$0.25"}},{"$f":"('Irr Sorghum Sudangrass'!G$46+(C93-C$91)*('Irr Sorghum Sudangrass'!$D$24))/C93","v":{"v":0.3070116359529253,"d":"$0.31"}},{"$f":"('Irr Sorghum Sudangrass'!F$60+(B93-B$91)*('Irr Sorghum Sudangrass'!$D$24))/B93","v":{"v":0.41019800383437893,"d":"$0.41"}},{"$f":"('Irr Sorghum Sudangrass'!G$60+(C93-C$91)*('Irr Sorghum Sudangrass'!$D$24))/C93","v":{"v":0.4324146210275522,"d":"$0.43"}},{"$f":"IF($D93=0,\"N/A\",('Irr Sorghum Sudangrass'!H$60+(D93-D$91)*('Irr Sorghum Sudangrass'!$D$24))/D93)","v":{"v":0.3701778181818182,"d":"$0.37"}}]
[]
[{"$f":"'Irr Soybeans'!A3:H3","v":"Irrigated Soybeans"}]
[{"$nulls":4},"BE Price to Cover Variable Costs",null,"BE Price to Cover Total Costs"]
["Yield","BU",null,null,"Total","Tenant","Total","Tenant","Landlord"]
[{"v":0.75,"d":"75%"},{"$f":"'Irr Soybeans'!$B$9*$A98","v":{"v":45,"d":"45.00"}},{"$f":"'Irr Soybeans'!$B$9*(1-'Irr Soybeans'!$E$9)*$A98","v":30.15},{"$f":"'Irr Soybeans'!$B$9*'Irr Soybeans'!$E$9*$A98","v":{"v":14.850000000000001,"d":"14.85"}},{"$f":"('Irr Soybeans'!F$49+(B98-B$100)*('Irr Soybeans'!$D$27))/B98","v":{"v":7.941742010666667,"d":"$7.94"}},{"$f":"('Irr Soybeans'!G$49+(C98-C$100)*('Irr Soybeans'!$D$27))/C98","v":{"v":10.494615497446103,"d":"$10.49"}},{"$f":"('Irr Soybeans'!F$63+(B98-B$100)*('Irr Soybeans'!$D$27))/B98","v":{"v":11.742186455111112,"d":"$11.74"}},{"$f":"('Irr Soybeans'!G$63+(C98-C$100)*('Irr Soybeans'!$D$27))/C98","v":{"v":13.778860936915423,"d":"$13.78"}},{"$f":"IF($D98=0,\"N/A\",('Irr Soybeans'!H$63+(D98-D$100)*('Irr Soybeans'!$D$27))/D98)","v":{"v":7.758552626262626,"d":"$7.76"}}]
[{"v":0.9,"d":"90%"},{"$f":"'Irr Soybeans'!$B$9*$A99","v":{"v":54,"d":"54.00"}},{"$f":"'Irr Soybeans'!$B$9*(1-'Irr Soybeans'!$E$9)*$A99","v":36.18},{"$f":"'Irr Soybeans'!$B$9*'Irr Soybeans'!$E$9*$A99","v":17.82},{"$f":"('Irr Soybeans'!F$49+(B99-B$100)*('Irr Soybeans'!$D$27))/B99","v":{"v":6.728118342222222,"d":"$6.73"}},{"$f":"('Irr Soybeans'!G$49+(C99-C$100)*('Irr Soybeans'!$D$27))/C99","v":{"v":8.85551291453842,"d":"$8.86"}},{"$f":"('Irr Soybeans'!F$63+(B99-B$100)*('Irr Soybeans'!$D$27))/B99","v":{"v":9.895155379259258,"d":"$9.90"}},{"$f":"('Irr Soybeans'!G$63+(C99-C$100)*('Irr Soybeans'!$D$27))/C99","v":{"v":11.592384114096186,"d":"$11.59"}},{"$f":"IF($D99=0,\"N/A\",('Irr Soybeans'!H$63+(D99-D$100)*('Irr Soybeans'!$D$27))/D99)","v":{"v":6.575460521885522,"d":"$6.58"}}]
[{"v":1,"d":"100%"},{"$f":"'Irr Soybeans'!$B$9*$A100","v":{"v":60,"d":"60.00"}},{"$f":"'Irr Soybeans'!$B$9*(1-'Irr Soybeans'!$E$9)*$A100","v":{"v":40.199999999999996,"d":"40.20"}},{"$f":"'Irr Soybeans'!$B$9*'Irr Soybeans'!$E$9*$A100","v":{"v":19.8,"d":"19.80"}},{"$f":"('Irr Soybeans'!F$49+(B100-B$100)*('Irr Soybeans'!$D$27))/B100","v":{"v":6.121306508,"d":"$6.12"}},{"$f":"('Irr Soybeans'!G$49+(C100-C$100)*('Irr Soybeans'!$D$27))/C100","v":{"v":8.035961623084578,"d":"$8.04"}},{"$f":"('Irr Soybeans'!F$63+(B100-B$100)*('Irr Soybeans'!$D$27))/B100","v":{"v":8.971639841333333,"d":"$8.97"}},{"$f":"('Irr Soybeans'!G$63+(C100-C$100)*('Irr Soybeans'!$D$27))/C100","v":{"v":10.499145702686567,"d":"$10.50"}},{"$f":"IF($D100=0,\"N/A\",('Irr Soybeans'!H$63+(D100-D$100)*('Irr Soybeans'!$D$27))/D100)","v":{"v":5.983914469696969,"d":"$5.98"}}]
[{"v":1.1,"d":"110%"},{"$f":"'Irr Soybeans'!$B$9*$A101","v":{"v":66,"d":"66.00"}},{"$f":"'Irr Soybeans'!$B$9*(1-'Irr Soybeans'!$E$9)*$A101","v":44.22},{"$f":"'Irr Soybeans'!$B$9*'Irr Soybeans'!$E$9*$A101","v":21.78},{"$f":"('Irr Soybeans'!F$49+(B101-B$100)*('Irr Soybeans'!$D$27))/B101","v":{"v":5.624824098181818,"d":"$5.62"}},{"$f":"('Irr Soybeans'!G$49+(C101-C$100)*('Irr Soybeans'!$D$27))/C101","v":{"v":7.365419657349617,"d":"$7.37"}},{"$f":"('Irr Soybeans'!F$63+(B101-B$100)*('Irr Soybeans'!$D$27))/B101","v":{"v":8.21603621939394,"d":"$8.22"}},{"$f":"('Irr Soybeans'!G$63+(C101-C$100)*('Irr Soybeans'!$D$27))/C101","v":{"v":9.604677911533244,"d":"$9.60"}},{"$f":"IF($D101=0,\"N/A\",('Irr Soybeans'!H$63+(D101-D$100)*('Irr Soybeans'!$D$27))/D101)","v":{"v":5.499922245179063,"d":"$5.50"}}]
[{"v":1.25,"d":"125%"},{"$f":"'Irr Soybeans'!$B$9*$A102","v":{"v":75,"d":"75.00"}},{"$f":"'Irr Soybeans'!$B$9*(1-'Irr Soybeans'!$E$9)*$A102","v":{"v":50.24999999999999,"d":"50.25"}},{"$f":"'Irr Soybeans'!$B$9*'Irr Soybeans'!$E$9*$A102","v":24.75},{"$f":"('Irr Soybeans'!F$49+(B102-B$100)*('Irr Soybeans'!$D$27))/B102","v":{"v":5.029045206399999,"d":"$5.03"}},{"$f":"('Irr Soybeans'!G$49+(C102-C$100)*('Irr Soybeans'!$D$27))/C102","v":{"v":6.560769298467662,"d":"$6.56"}},{"$f":"('Irr Soybeans'!F$63+(B102-B$100)*('Irr Soybeans'!$D$27))/B102","v":{"v":7.309311873066666,"d":"$7.31"}},{"$f":"('Irr Soybeans'!G$63+(C102-C$100)*('Irr Soybeans'!$D$27))/C102","v":{"v":8.531316562149254,"d":"$8.53"}},{"$f":"IF($D102=0,\"N/A\",('Irr Soybeans'!H$63+(D102-D$100)*('Irr Soybeans'!$D$27))/D102)","v":{"v":4.919131575757575,"d":"$4.92"}}]
[]
[{"$f":"'Irr Sunflowers-Confection'!A3:H3","v":"Irrigated Sunflowers-Confectionary "}]
[{"$nulls":4},"BE Price to Cover Variable Costs",null,"BE Price to Cover Total Costs"]
["Yield","CWT",null,null,"Total","Tenant","Total","Tenant","Landlord"]
[{"v":0.75,"d":"75%"},{"$f":"'Irr Sunflowers-Confection'!$B$9*$A107","v":{"v":13.5,"d":"13.50"}},{"$f":"'Irr Sunflowers-Confection'!$B$9*(1-'Irr Sunflowers-Confection'!$E$9)*$A107","v":{"v":9.044999999999998,"d":"9.05"}},{"$f":"'Irr Sunflowers-Confection'!$B$9*'Irr Sunflowers-Confection'!$E$9*$A107","v":{"v":4.455,"d":"4.46"}},{"$f":"('Irr Sunflowers-Confection'!F$49+(B107-B$109)*('Irr Sunflowers-Confection'!$D$26))/B107","v":{"v":20.95171171481481,"d":"$20.95"}},{"$f":"('Irr Sunflowers-Confection'!G$49+(C107-C$109)*('Irr Sunflowers-Confection'!$D$26))/C107","v":{"v":26.029704207227752,"d":"$26.03"}},{"$f":"('Irr Sunflowers-Confection'!F$63+(B107-B$109)*('Irr Sunflowers-Confection'!$D$26))/B107","v":{"v":32.24282282592592,"d":"$32.24"}},{"$f":"('Irr Sunflowers-Confection'!G$63+(C107-C$109)*('Irr Sunflowers-Confection'!$D$26))/C107","v":{"v":34.921909845702054,"d":"$34.92"}},{"$f":"IF($D107=0, \"N/A\", ('Irr Sunflowers-Confection'!H$63+(D107-D$109)*('Irr Sunflowers-Confection'!$D$26))/D107)","v":{"v":26.874304518097645,"d":"$26.87"}}]
[{"v":0.9,"d":"90%"},{"$f":"'Irr Sunflowers-Confection'!$B$9*$A108","v":{"v":16.2,"d":"16.20"}},{"$f":"'Irr Sunflowers-Confection'!$B$9*(1-'Irr Sunflowers-Confection'!$E$9)*$A108","v":{"v":10.854,"d":"10.85"}},{"$f":"'Irr Sunflowers-Confection'!$B$9*'Irr Sunflowers-Confection'!$E$9*$A108","v":{"v":5.346,"d":"5.35"}},{"$f":"('Irr Sunflowers-Confection'!F$49+(B108-B$109)*('Irr Sunflowers-Confection'!$D$26))/B108","v":{"v":17.534759762345672,"d":"$17.53"}},{"$f":"('Irr Sunflowers-Confection'!G$49+(C108-C$109)*('Irr Sunflowers-Confection'!$D$26))/C108","v":{"v":21.76642017268979,"d":"$21.77"}},{"$f":"('Irr Sunflowers-Confection'!F$63+(B108-B$109)*('Irr Sunflowers-Confection'!$D$26))/B108","v":{"v":26.944019021604934,"d":"$26.94"}},{"$f":"('Irr Sunflowers-Confection'!G$63+(C108-C$109)*('Irr Sunflowers-Confection'!$D$26))/C108","v":{"v":29.176591538085034,"d":"$29.18"}},{"$f":"IF($D108=0, \"N/A\", ('Irr Sunflowers-Confection'!H$63+(D108-D$109)*('Irr Sunflowers-Confection'!$D$26))/D108)","v":{"v":22.47025376508137,"d":"$22.47"}}]
[{"v":1,"d":"100%"},{"$f":"'Irr Sunflowers-Confection'!$B$9*$A109","v":{"v":18,"d":"18.00"}},{"$f":"'Irr Sunflowers-Confection'!$B$9*(1-'Irr Sunflowers-Confection'!$E$9)*$A109","v":{"v":12.059999999999999,"d":"12.06"}},{"$f":"'Irr Sunflowers-Confection'!$B$9*'Irr Sunflowers-Confection'!$E$9*$A109","v":5.94},{"$f":"('Irr Sunflowers-Confection'!F$49+(B109-B$109)*('Irr Sunflowers-Confection'!$D$26))/B109","v":{"v":15.826283786111105,"d":"$15.83"}},{"$f":"('Irr Sunflowers-Confection'!G$49+(C109-C$109)*('Irr Sunflowers-Confection'!$D$26))/C109","v":{"v":19.634778155420815,"d":"$19.63"}},{"$f":"('Irr Sunflowers-Confection'!F$63+(B109-B$109)*('Irr Sunflowers-Confection'!$D$26))/B109","v":{"v":24.29461711944444,"d":"$24.29"}},{"$f":"('Irr Sunflowers-Confection'!G$63+(C109-C$109)*('Irr Sunflowers-Confection'!$D$26))/C109","v":{"v":26.303932384276536,"d":"$26.30"}},{"$f":"IF($D109=0, \"N/A\", ('Irr Sunflowers-Confection'!H$63+(D109-D$109)*('Irr Sunflowers-Confection'!$D$26))/D109)","v":{"v":20.26822838857323,"d":"$20.27"}}]
[{"v":1.1,"d":"110%"},{"$f":"'Irr Sunflowers-Confection'!$B$9*$A110","v":{"v":19.8,"d":"19.80"}},{"$f":"'Irr Sunflowers-Confection'!$B$9*(1-'Irr Sunflowers-Confection'!$E$9)*$A110","v":{"v":13.266,"d":"13.27"}},{"$f":"'Irr Sunflowers-Confection'!$B$9*'Irr Sunflowers-Confection'!$E$9*$A110","v":{"v":6.534000000000001,"d":"6.53"}},{"$f":"('Irr Sunflowers-Confection'!F$49+(B110-B$109)*('Irr Sunflowers-Confection'!$D$26))/B110","v":{"v":14.42843980555555,"d":"$14.43"}},{"$f":"('Irr Sunflowers-Confection'!G$49+(C110-C$109)*('Irr Sunflowers-Confection'!$D$26))/C110","v":{"v":17.89070741401892,"d":"$17.89"}},{"$f":"('Irr Sunflowers-Confection'!F$63+(B110-B$109)*('Irr Sunflowers-Confection'!$D$26))/B110","v":{"v":22.126924654040398,"d":"$22.13"}},{"$f":"('Irr Sunflowers-Confection'!G$63+(C110-C$109)*('Irr Sunflowers-Confection'!$D$26))/C110","v":{"v":23.953574894796848,"d":"$23.95"}},{"$f":"IF($D110=0, \"N/A\", ('Irr Sunflowers-Confection'!H$63+(D110-D$109)*('Irr Sunflowers-Confection'!$D$26))/D110)","v":{"v":18.4665712623393,"d":"$18.47"}}]
[{"v":1.25,"d":"125%"},{"$f":"'Irr Sunflowers-Confection'!$B$9*$A111","v":{"v":22.5,"d":"22.50"}},{"$f":"'Irr Sunflowers-Confection'!$B$9*(1-'Irr Sunflowers-Confection'!$E$9)*$A111","v":{"v":15.075,"d":"15.08"}},{"$f":"'Irr Sunflowers-Confection'!$B$9*'Irr Sunflowers-Confection'!$E$9*$A111","v":{"v":7.425000000000001,"d":"7.43"}},{"$f":"('Irr Sunflowers-Confection'!F$49+(B111-B$109)*('Irr Sunflowers-Confection'!$D$26))/B111","v":{"v":12.751027028888883,"d":"$12.75"}},{"$f":"('Irr Sunflowers-Confection'!G$49+(C111-C$109)*('Irr Sunflowers-Confection'!$D$26))/C111","v":{"v":15.79782252433665,"d":"$15.80"}},{"$f":"('Irr Sunflowers-Confection'!F$63+(B111-B$109)*('Irr Sunflowers-Confection'!$D$26))/B111","v":{"v":19.52569369555555,"d":"$19.53"}},{"$f":"('Irr Sunflowers-Confection'!G$63+(C111-C$109)*('Irr Sunflowers-Confection'!$D$26))/C111","v":{"v":21.133145907421223,"d":"$21.13"}},{"$f":"IF($D111=0, \"N/A\", ('Irr Sunflowers-Confection'!H$63+(D111-D$109)*('Irr Sunflowers-Confection'!$D$26))/D111)","v":{"v":16.304582710858586,"d":"$16.30"}}]
[]
[{"$f":"'Irr Sunflowers-Oilseed'!A3:H3","v":"Irrigated Sunflowers-Oilseed "}]
[{"$nulls":4},"BE Price to Cover Variable Costs",null,"BE Price to Cover Total Costs"]
["Yield","CWT",null,null,"Total","Tenant","Total","Tenant","Landlord"]
[{"v":0.75,"d":"75%"},{"$f":"'Irr Sunflowers-Oilseed'!$B$9*$A116","v":{"v":15,"d":"15.00"}},{"$f":"'Irr Sunflowers-Oilseed'!$B$9*(1-'Irr Sunflowers-Oilseed'!$E$9)*$A116","v":{"v":10.049999999999999,"d":"10.05"}},{"$f":"'Irr Sunflowers-Oilseed'!$B$9*'Irr Sunflowers-Oilseed'!$E$9*$A116","v":4.95},{"$f":"('Irr Sunflowers-Oilseed'!F$48+(B116-B$118)*('Irr Sunflowers-Oilseed'!$D$25))/B116","v":{"v":18.775035781428567,"d":"$18.78"}},{"$f":"('Irr Sunflowers-Oilseed'!G$48+(C116-C$118)*('Irr Sunflowers-Oilseed'!$D$25))/C116","v":{"v":22.202562841231348,"d":"$22.20"}},{"$f":"('Irr Sunflowers-Oilseed'!F$62+(B116-B$118)*('Irr Sunflowers-Oilseed'!$D$25))/B116","v":{"v":28.937035781428566,"d":"$28.94"}},{"$f":"('Irr Sunflowers-Oilseed'!G$62+(C116-C$118)*('Irr Sunflowers-Oilseed'!$D$25))/C116","v":{"v":30.205547915858215,"d":"$30.21"}},{"$f":"IF($D116=0, \"N/A\", ('Irr Sunflowers-Oilseed'!H$62+(D116-D$118)*('Irr Sunflowers-Oilseed'!$D$25))/D116)","v":{"v":26.42484739962121,"d":"$26.42"}}]
[{"v":0.9,"d":"90%"},{"$f":"'Irr Sunflowers-Oilseed'!$B$9*$A117","v":{"v":18,"d":"18.00"}},{"$f":"'Irr Sunflowers-Oilseed'!$B$9*(1-'Irr Sunflowers-Oilseed'!$E$9)*$A117","v":{"v":12.059999999999999,"d":"12.06"}},{"$f":"'Irr Sunflowers-Oilseed'!$B$9*'Irr Sunflowers-Oilseed'!$E$9*$A117","v":5.94},{"$f":"('Irr Sunflowers-Oilseed'!F$48+(B117-B$118)*('Irr Sunflowers-Oilseed'!$D$25))/B117","v":{"v":15.720863151190473,"d":"$15.72"}},{"$f":"('Irr Sunflowers-Oilseed'!G$48+(C117-C$118)*('Irr Sunflowers-Oilseed'!$D$25))/C117","v":{"v":18.57713570102612,"d":"$18.58"}},{"$f":"('Irr Sunflowers-Oilseed'!F$62+(B117-B$118)*('Irr Sunflowers-Oilseed'!$D$25))/B117","v":{"v":24.189196484523805,"d":"$24.19"}},{"$f":"('Irr Sunflowers-Oilseed'!G$62+(C117-C$118)*('Irr Sunflowers-Oilseed'!$D$25))/C117","v":{"v":25.246289929881844,"d":"$25.25"}},{"$f":"IF($D117=0, \"N/A\", ('Irr Sunflowers-Oilseed'!H$62+(D117-D$118)*('Irr Sunflowers-Oilseed'!$D$25))/D117)","v":{"v":22.095706166351007,"d":"$22.10"}}]
[{"v":1,"d":"100%"},{"$f":"'Irr Sunflowers-Oilseed'!$B$9*$A118","v":{"v":20,"d":"20.00"}},{"$f":"'Irr Sunflowers-Oilseed'!$B$9*(1-'Irr Sunflowers-Oilseed'!$E$9)*$A118","v":{"v":13.399999999999999,"d":"13.40"}},{"$f":"'Irr Sunflowers-Oilseed'!$B$9*'Irr Sunflowers-Oilseed'!$E$9*$A118","v":{"v":6.6000000000000005,"d":"6.60"}},{"$f":"('Irr Sunflowers-Oilseed'!F$48+(B118-B$118)*('Irr Sunflowers-Oilseed'!$D$25))/B118","v":{"v":14.193776836071425,"d":"$14.19"}},{"$f":"('Irr Sunflowers-Oilseed'!G$48+(C118-C$118)*('Irr Sunflowers-Oilseed'!$D$25))/C118","v":{"v":16.76442213092351,"d":"$16.76"}},{"$f":"('Irr Sunflowers-Oilseed'!F$62+(B118-B$118)*('Irr Sunflowers-Oilseed'!$D$25))/B118","v":{"v":21.815276836071426,"d":"$21.82"}},{"$f":"('Irr Sunflowers-Oilseed'!G$62+(C118-C$118)*('Irr Sunflowers-Oilseed'!$D$25))/C118","v":{"v":22.76666093689366,"d":"$22.77"}},{"$f":"IF($D118=0, \"N/A\", ('Irr Sunflowers-Oilseed'!H$62+(D118-D$118)*('Irr Sunflowers-Oilseed'!$D$25))/D118)","v":{"v":19.931135549715908,"d":"$19.93"}}]
[{"v":1.1,"d":"110%"},{"$f":"'Irr Sunflowers-Oilseed'!$B$9*$A119","v":{"v":22,"d":"22.00"}},{"$f":"'Irr Sunflowers-Oilseed'!$B$9*(1-'Irr Sunflowers-Oilseed'!$E$9)*$A119","v":14.74},{"$f":"'Irr Sunflowers-Oilseed'!$B$9*'Irr Sunflowers-Oilseed'!$E$9*$A119","v":{"v":7.260000000000002,"d":"7.26"}},{"$f":"('Irr Sunflowers-Oilseed'!F$48+(B119-B$118)*('Irr Sunflowers-Oilseed'!$D$25))/B119","v":{"v":12.944342578246749,"d":"$12.94"}},{"$f":"('Irr Sunflowers-Oilseed'!G$48+(C119-C$118)*('Irr Sunflowers-Oilseed'!$D$25))/C119","v":{"v":15.281292846294098,"d":"$15.28"}},{"$f":"('Irr Sunflowers-Oilseed'!F$62+(B119-B$118)*('Irr Sunflowers-Oilseed'!$D$25))/B119","v":{"v":19.87297894188311,"d":"$19.87"}},{"$f":"('Irr Sunflowers-Oilseed'!G$62+(C119-C$118)*('Irr Sunflowers-Oilseed'!$D$25))/C119","v":{"v":20.737873578994233,"d":"$20.74"}},{"$f":"IF($D119=0, \"N/A\", ('Irr Sunflowers-Oilseed'!H$62+(D119-D$118)*('Irr Sunflowers-Oilseed'!$D$25))/D119)","v":{"v":18.16012322701446,"d":"$18.16"}}]
[{"v":1.25,"d":"125%"},{"$f":"'Irr Sunflowers-Oilseed'!$B$9*$A120","v":{"v":25,"d":"25.00"}},{"$f":"'Irr Sunflowers-Oilseed'!$B$9*(1-'Irr Sunflowers-Oilseed'!$E$9)*$A120","v":16.75},{"$f":"'Irr Sunflowers-Oilseed'!$B$9*'Irr Sunflowers-Oilseed'!$E$9*$A120","v":8.25},{"$f":"('Irr Sunflowers-Oilseed'!F$48+(B120-B$118)*('Irr Sunflowers-Oilseed'!$D$25))/B120","v":{"v":11.44502146885714,"d":"$11.45"}},{"$f":"('Irr Sunflowers-Oilseed'!G$48+(C120-C$118)*('Irr Sunflowers-Oilseed'!$D$25))/C120","v":{"v":13.501537704738805,"d":"$13.50"}},{"$f":"('Irr Sunflowers-Oilseed'!F$62+(B120-B$118)*('Irr Sunflowers-Oilseed'!$D$25))/B120","v":{"v":17.54222146885714,"d":"$17.54"}},{"$f":"('Irr Sunflowers-Oilseed'!G$62+(C120-C$118)*('Irr Sunflowers-Oilseed'!$D$25))/C120","v":{"v":18.303328749514925,"d":"$18.30"}},{"$f":"IF($D120=0, \"N/A\", ('Irr Sunflowers-Oilseed'!H$62+(D120-D$118)*('Irr Sunflowers-Oilseed'!$D$25))/D120)","v":{"v":16.034908439772728,"d":"$16.03"}}]
[]
[{"$f":"'Irr Triticale Silage'!A3:H3","v":"Irrigated Triticale Silage"}]
[{"$nulls":4},"BE Price to Cover Variable Costs",null,"BE Price to Cover Total Costs"]
["Yield","LB",null,null,"Total","Tenant","Total","Tenant","Landlord"]
[{"v":0.75,"d":"75%"},{"$f":"'Irr Triticale Silage'!$B$9*$A125","v":{"v":7.5,"d":"7.50"}},{"$f":"'Irr Triticale Silage'!$B$9*(1-'Irr Triticale Silage'!$E$9)*$A125","v":{"v":5.0249999999999995,"d":"5.03"}},{"$f":"'Irr Triticale Silage'!$B$9*'Irr Triticale Silage'!$E$9*$A125","v":{"v":2.475,"d":"2.48"}},{"$f":"('Irr Triticale Silage'!F$46+(B125-B$127)*('Irr Triticale Silage'!$D$24))/B125","v":{"v":38.85432478972549,"d":"$38.85"}},{"$f":"('Irr Triticale Silage'!G$46+(C125-C$127)*('Irr Triticale Silage'!$D$24))/C125","v":{"v":52.94379319592039,"d":"$52.94"}},{"$f":"('Irr Triticale Silage'!F$60+(B125-B$127)*('Irr Triticale Silage'!$D$24))/B125","v":{"v":60.17699145639215,"d":"$60.18"}},{"$f":"('Irr Triticale Silage'!G$60+(C125-C$127)*('Irr Triticale Silage'!$D$24))/C125","v":{"v":70.44031060885573,"d":"$70.44"}},{"$f":"IF($D125=0,\"N/A\",('Irr Triticale Silage'!H$60+(D125-D$127)*('Irr Triticale Silage'!$D$24))/D125)","v":{"v":38.921562424242424,"d":"$38.92"}}]
[{"v":0.9,"d":"90%"},{"$f":"'Irr Triticale Silage'!$B$9*$A126","v":{"v":9,"d":"9.00"}},{"$f":"'Irr Triticale Silage'!$B$9*(1-'Irr Triticale Silage'!$E$9)*$A126","v":{"v":6.029999999999999,"d":"6.03"}},{"$f":"'Irr Triticale Silage'!$B$9*'Irr Triticale Silage'!$E$9*$A126","v":2.97},{"$f":"('Irr Triticale Silage'!F$46+(B126-B$127)*('Irr Triticale Silage'!$D$24))/B126","v":{"v":33.878603991437906,"d":"$33.88"}},{"$f":"('Irr Triticale Silage'!G$46+(C126-C$127)*('Irr Triticale Silage'!$D$24))/C126","v":{"v":45.619827663266996,"d":"$45.62"}},{"$f":"('Irr Triticale Silage'!F$60+(B126-B$127)*('Irr Triticale Silage'!$D$24))/B126","v":{"v":51.647492880326794,"d":"$51.65"}},{"$f":"('Irr Triticale Silage'!G$60+(C126-C$127)*('Irr Triticale Silage'!$D$24))/C126","v":{"v":60.200258840713104,"d":"$60.20"}},{"$f":"IF($D126=0,\"N/A\",('Irr Triticale Silage'!H$60+(D126-D$127)*('Irr Triticale Silage'!$D$24))/D126)","v":{"v":33.93463535353535,"d":"$33.93"}}]
[{"v":1,"d":"100%"},{"$f":"'Irr Triticale Silage'!$B$9*$A127","v":{"v":10,"d":"10.00"}},{"$f":"'Irr Triticale Silage'!$B$9*(1-'Irr Triticale Silage'!$E$9)*$A127","v":{"v":6.699999999999999,"d":"6.70"}},{"$f":"'Irr Triticale Silage'!$B$9*'Irr Triticale Silage'!$E$9*$A127","v":{"v":3.3000000000000003,"d":"3.30"}},{"$f":"('Irr Triticale Silage'!F$46+(B127-B$127)*('Irr Triticale Silage'!$D$24))/B127","v":{"v":31.390743592294115,"d":"$31.39"}},{"$f":"('Irr Triticale Silage'!G$46+(C127-C$127)*('Irr Triticale Silage'!$D$24))/C127","v":{"v":41.957844896940294,"d":"$41.96"}},{"$f":"('Irr Triticale Silage'!F$60+(B127-B$127)*('Irr Triticale Silage'!$D$24))/B127","v":{"v":47.38274359229412,"d":"$47.38"}},{"$f":"('Irr Triticale Silage'!G$60+(C127-C$127)*('Irr Triticale Silage'!$D$24))/C127","v":{"v":55.08023295664179,"d":"$55.08"}},{"$f":"IF($D127=0,\"N/A\",('Irr Triticale Silage'!H$60+(D127-D$127)*('Irr Triticale Silage'!$D$24))/D127)","v":{"v":31.441171818181815,"d":"$31.44"}}]
[{"v":1.1,"d":"110%"},{"$f":"'Irr Triticale Silage'!$B$9*$A128","v":{"v":11,"d":"11.00"}},{"$f":"'Irr Triticale Silage'!$B$9*(1-'Irr Triticale Silage'!$E$9)*$A128","v":7.37},{"$f":"'Irr Triticale Silage'!$B$9*'Irr Triticale Silage'!$E$9*$A128","v":{"v":3.630000000000001,"d":"3.63"}},{"$f":"('Irr Triticale Silage'!F$46+(B128-B$127)*('Irr Triticale Silage'!$D$24))/B128","v":{"v":29.355221447540103,"d":"$29.36"}},{"$f":"('Irr Triticale Silage'!G$46+(C128-C$127)*('Irr Triticale Silage'!$D$24))/C128","v":{"v":38.96167717903663,"d":"$38.96"}},{"$f":"('Irr Triticale Silage'!F$60+(B128-B$127)*('Irr Triticale Silage'!$D$24))/B128","v":{"v":43.89340326572192,"d":"$43.89"}},{"$f":"('Irr Triticale Silage'!G$60+(C128-C$127)*('Irr Triticale Silage'!$D$24))/C128","v":{"v":50.89112086967435,"d":"$50.89"}},{"$f":"IF($D128=0,\"N/A\",('Irr Triticale Silage'!H$60+(D128-D$127)*('Irr Triticale Silage'!$D$24))/D128)","v":{"v":29.40106528925619,"d":"$29.40"}}]
[{"v":1.25,"d":"125%"},{"$f":"'Irr Triticale Silage'!$B$9*$A129","v":{"v":12.5,"d":"12.50"}},{"$f":"'Irr Triticale Silage'!$B$9*(1-'Irr Triticale Silage'!$E$9)*$A129","v":{"v":8.375,"d":"8.38"}},{"$f":"'Irr Triticale Silage'!$B$9*'Irr Triticale Silage'!$E$9*$A129","v":{"v":4.125,"d":"4.13"}},{"$f":"('Irr Triticale Silage'!F$46+(B129-B$127)*('Irr Triticale Silage'!$D$24))/B129","v":{"v":26.912594873835292,"d":"$26.91"}},{"$f":"('Irr Triticale Silage'!G$46+(C129-C$127)*('Irr Triticale Silage'!$D$24))/C129","v":{"v":35.36627591755223,"d":"$35.37"}},{"$f":"('Irr Triticale Silage'!F$60+(B129-B$127)*('Irr Triticale Silage'!$D$24))/B129","v":{"v":39.706194873835294,"d":"$39.71"}},{"$f":"('Irr Triticale Silage'!G$60+(C129-C$127)*('Irr Triticale Silage'!$D$24))/C129","v":{"v":45.86418636531342,"d":"$45.86"}},{"$f":"IF($D129=0,\"N/A\",('Irr Triticale Silage'!H$60+(D129-D$127)*('Irr Triticale Silage'!$D$24))/D129)","v":{"v":26.952937454545452,"d":"$26.95"}}]
[]
[{"$f":"'Irr Wheat'!A3:H3","v":"Irrigated Wheat"}]
[{"$nulls":4},"BE Price to Cover Variable Costs",null,"BE Price to Cover Total Costs"]
["Yield","BU",null,null,"Total","Tenant","Total","Tenant","Landlord"]
[{"v":0.75,"d":"75%"},{"$f":"'Irr Wheat'!$B$9*$A134","v":{"v":37.5,"d":"37.50"}},{"$f":"'Irr Wheat'!$B$9*(1-'Irr Wheat'!$E$9)*$A134","v":{"v":25.125,"d":"25.13"}},{"$f":"'Irr Wheat'!$B$9*'Irr Wheat'!$E$9*$A134","v":{"v":12.375,"d":"12.38"}},{"$f":"('Irr Wheat'!$F$47-'Irr Wheat'!$F$10+($B134-$B$136)*'Irr Wheat'!$D$25)/$B134","v":{"v":5.831684329004443,"d":"$5.83"}},{"$f":"('Irr Wheat'!$G$47-'Irr Wheat'!$G$10+($C134-$C$136)*'Irr Wheat'!$D$25)/$C134","v":{"v":7.7056478821899494,"d":"$7.71"}},{"$f":"('Irr Wheat'!$F$61-'Irr Wheat'!$F$10+($B134-$B$136)*'Irr Wheat'!$D$25)/$B134","v":{"v":10.096217662337777,"d":"$10.10"}},{"$f":"('Irr Wheat'!$G$61-'Irr Wheat'!$G$10+($C134-$C$136)*'Irr Wheat'!$D$25)/$C134","v":{"v":11.204951364777017,"d":"$11.20"}},{"$f":"IF($D134=0, \"N/A\", ('Irr Wheat'!$H$61-'Irr Wheat'!$H$10+($D134-$D$136)*'Irr Wheat'!$D$25)/$D134)","v":{"v":7.72104213068182,"d":"$7.72"}}]
[{"v":0.9,"d":"90%"},{"$f":"'Irr Wheat'!$B$9*$A135","v":{"v":45,"d":"45.00"}},{"$f":"'Irr Wheat'!$B$9*(1-'Irr Wheat'!$E$9)*$A135","v":{"v":30.150000000000002,"d":"30.15"}},{"$f":"'Irr Wheat'!$B$9*'Irr Wheat'!$E$9*$A135","v":14.85},{"$f":"('Irr Wheat'!$F$47-'Irr Wheat'!$F$10+($B135-$B$136)*'Irr Wheat'!$D$25)/$B135","v":{"v":4.959736940837036,"d":"$4.96"}},{"$f":"('Irr Wheat'!$G$47-'Irr Wheat'!$G$10+($C135-$C$136)*'Irr Wheat'!$D$25)/$C135","v":{"v":6.521373235158291,"d":"$6.52"}},{"$f":"('Irr Wheat'!$F$61-'Irr Wheat'!$F$10+($B135-$B$136)*'Irr Wheat'!$D$25)/$B135","v":{"v":8.513514718614813,"d":"$8.51"}},{"$f":"('Irr Wheat'!$G$61-'Irr Wheat'!$G$10+($C135-$C$136)*'Irr Wheat'!$D$25)/$C135","v":{"v":9.437459470647513,"d":"$9.44"}},{"$f":"IF($D135=0, \"N/A\", ('Irr Wheat'!$H$61-'Irr Wheat'!$H$10+($D135-$D$136)*'Irr Wheat'!$D$25)/$D135)","v":{"v":6.534201775568183,"d":"$6.53"}}]
[{"v":1,"d":"100%"},{"$f":"'Irr Wheat'!$B$9*$A136","v":{"v":50,"d":"50.00"}},{"$f":"'Irr Wheat'!$B$9*(1-'Irr Wheat'!$E$9)*$A136","v":{"v":33.5,"d":"33.50"}},{"$f":"'Irr Wheat'!$B$9*'Irr Wheat'!$E$9*$A136","v":{"v":16.5,"d":"16.50"}},{"$f":"('Irr Wheat'!$F$47-'Irr Wheat'!$F$10+($B136-$B$136)*'Irr Wheat'!$D$25)/$B136","v":{"v":4.523763246753332,"d":"$4.52"}},{"$f":"('Irr Wheat'!$G$47-'Irr Wheat'!$G$10+($C136-$C$136)*'Irr Wheat'!$D$25)/$C136","v":{"v":5.929235911642462,"d":"$5.93"}},{"$f":"('Irr Wheat'!$F$61-'Irr Wheat'!$F$10+($B136-$B$136)*'Irr Wheat'!$D$25)/$B136","v":{"v":7.7221632467533325,"d":"$7.72"}},{"$f":"('Irr Wheat'!$G$61-'Irr Wheat'!$G$10+($C136-$C$136)*'Irr Wheat'!$D$25)/$C136","v":{"v":8.553713523582761,"d":"$8.55"}},{"$f":"IF($D136=0, \"N/A\", ('Irr Wheat'!$H$61-'Irr Wheat'!$H$10+($D136-$D$136)*'Irr Wheat'!$D$25)/$D136)","v":{"v":5.940781598011364,"d":"$5.94"}}]
[{"v":1.1,"d":"110%"},{"$f":"'Irr Wheat'!$B$9*$A137","v":{"v":55.00000000000001,"d":"55.00"}},{"$f":"'Irr Wheat'!$B$9*(1-'Irr Wheat'!$E$9)*$A137","v":36.85},{"$f":"'Irr Wheat'!$B$9*'Irr Wheat'!$E$9*$A137","v":{"v":18.150000000000002,"d":"18.15"}},{"$f":"('Irr Wheat'!$F$47-'Irr Wheat'!$F$10+($B137-$B$136)*'Irr Wheat'!$D$25)/$B137","v":{"v":4.167057497048484,"d":"$4.17"}},{"$f":"('Irr Wheat'!$G$47-'Irr Wheat'!$G$10+($C137-$C$136)*'Irr Wheat'!$D$25)/$C137","v":{"v":5.444759919674965,"d":"$5.44"}},{"$f":"('Irr Wheat'!$F$61-'Irr Wheat'!$F$10+($B137-$B$136)*'Irr Wheat'!$D$25)/$B137","v":{"v":7.074693860684847,"d":"$7.07"}},{"$f":"('Irr Wheat'!$G$61-'Irr Wheat'!$G$10+($C137-$C$136)*'Irr Wheat'!$D$25)/$C137","v":{"v":7.83064865780251,"d":"$7.83"}},{"$f":"IF($D137=0, \"N/A\", ('Irr Wheat'!$H$61-'Irr Wheat'!$H$10+($D137-$D$136)*'Irr Wheat'!$D$25)/$D137)","v":{"v":5.455255998192149,"d":"$5.46"}}]
[{"v":1.25,"d":"125%"},{"$f":"'Irr Wheat'!$B$9*$A138","v":{"v":62.5,"d":"62.50"}},{"$f":"'Irr Wheat'!$B$9*(1-'Irr Wheat'!$E$9)*$A138","v":{"v":41.875,"d":"41.88"}},{"$f":"'Irr Wheat'!$B$9*'Irr Wheat'!$E$9*$A138","v":{"v":20.625,"d":"20.63"}},{"$f":"('Irr Wheat'!$F$47-'Irr Wheat'!$F$10+($B138-$B$136)*'Irr Wheat'!$D$25)/$B138","v":{"v":3.739010597402666,"d":"$3.74"}},{"$f":"('Irr Wheat'!$G$47-'Irr Wheat'!$G$10+($C138-$C$136)*'Irr Wheat'!$D$25)/$C138","v":{"v":4.86338872931397,"d":"$4.86"}},{"$f":"('Irr Wheat'!$F$61-'Irr Wheat'!$F$10+($B138-$B$136)*'Irr Wheat'!$D$25)/$B138","v":{"v":6.297730597402666,"d":"$6.30"}},{"$f":"('Irr Wheat'!$G$61-'Irr Wheat'!$G$10+($C138-$C$136)*'Irr Wheat'!$D$25)/$C138","v":{"v":6.962970818866209,"d":"$6.96"}},{"$f":"IF($D138=0, \"N/A\", ('Irr Wheat'!$H$61-'Irr Wheat'!$H$10+($D138-$D$136)*'Irr Wheat'!$D$25)/$D138)","v":{"v":4.8726252784090915,"d":"$4.87"}}]
[]
[{"$f":"'Irr Other Crop'!A3:H3","v":"Irrigated Other Crop"}]
[{"$nulls":4},"BE Price to Cover Variable Costs",null,"BE Price to Cover Total Costs"]
["Yield","LB",null,null,"Total","Tenant","Total","Tenant","Landlord"]
[{"v":0.75,"d":"75%"},{"$f":"'Irr Other Crop'!$B$9*$A143","v":{"v":0,"d":"0.00"}},{"$f":"'Irr Other Crop'!$B$9*(1-'Irr Other Crop'!$E$9)*$A143","v":{"v":0,"d":"0.00"}},{"$f":"'Irr Other Crop'!$B$9*'Irr Other Crop'!$E$9*$A143","v":{"v":0,"d":"0.00"}},{"$f":"IF($B143=0, \"N/A\", ('Irr Other Crop'!$F$48-'Irr Other Crop'!$F$10+($B143-$B$145)*'Irr Other Crop'!$D$26)/$B143)","v":"N/A"},{"$f":"IF($B143=0, \"N/A\",('Irr Other Crop'!$G$48-'Irr Other Crop'!$G$10+($C143-$C$145)*'Irr Other Crop'!$D$26)/$C143)","v":"N/A"},{"$f":"IF($B143=0, \"N/A\",('Irr Other Crop'!$F$62-'Irr Other Crop'!$F$10+($B143-$B$145)*'Irr Other Crop'!$D$26)/$B143)","v":"N/A"},{"$f":"IF($B143=0, \"N/A\",('Irr Other Crop'!$G$62-'Irr Other Crop'!$G$10+($C143-$C$145)*'Irr Other Crop'!$D$26)/$C143)","v":"N/A"},{"$f":"IF($D143=0, \"N/A\", ('Irr Other Crop'!$H$62-'Irr Other Crop'!$H$10+($D143-$D$145)*'Irr Other Crop'!$D$26)/$D143)","v":"N/A"}]
[{"v":0.9,"d":"90%"},{"$f":"'Irr Other Crop'!$B$9*$A144","v":{"v":0,"d":"0.00"}},{"$f":"'Irr Other Crop'!$B$9*(1-'Irr Other Crop'!$E$9)*$A144","v":{"v":0,"d":"0.00"}},{"$f":"'Irr Other Crop'!$B$9*'Irr Other Crop'!$E$9*$A144","v":{"v":0,"d":"0.00"}},{"$f":"IF($B144=0, \"N/A\", ('Irr Other Crop'!$F$48-'Irr Other Crop'!$F$10+($B144-$B$145)*'Irr Other Crop'!$D$26)/$B144)","v":"N/A"},{"$f":"IF($B144=0, \"N/A\",('Irr Other Crop'!$G$48-'Irr Other Crop'!$G$10+($C144-$C$145)*'Irr Other Crop'!$D$26)/$C144)","v":"N/A"},{"$f":"IF($B144=0, \"N/A\",('Irr Other Crop'!$F$62-'Irr Other Crop'!$F$10+($B144-$B$145)*'Irr Other Crop'!$D$26)/$B144)","v":"N/A"},{"$f":"IF($B144=0, \"N/A\",('Irr Other Crop'!$G$62-'Irr Other Crop'!$G$10+($C144-$C$145)*'Irr Other Crop'!$D$26)/$C144)","v":"N/A"},{"$f":"IF($D144=0, \"N/A\", ('Irr Other Crop'!$H$62-'Irr Other Crop'!$H$10+($D144-$D$145)*'Irr Other Crop'!$D$26)/$D144)","v":"N/A"}]
[{"v":1,"d":"100%"},{"$f":"'Irr Other Crop'!$B$9*$A145","v":{"v":0,"d":"0.00"}},{"$f":"'Irr Other Crop'!$B$9*(1-'Irr Other Crop'!$E$9)*$A145","v":{"v":0,"d":"0.00"}},{"$f":"'Irr Other Crop'!$B$9*'Irr Other Crop'!$E$9*$A145","v":{"v":0,"d":"0.00"}},{"$f":"IF($B145=0, \"N/A\", ('Irr Other Crop'!$F$48-'Irr Other Crop'!$F$10+($B145-$B$145)*'Irr Other Crop'!$D$26)/$B145)","v":"N/A"},{"$f":"IF($B145=0, \"N/A\",('Irr Other Crop'!$G$48-'Irr Other Crop'!$G$10+($C145-$C$145)*'Irr Other Crop'!$D$26)/$C145)","v":"N/A"},{"$f":"IF($B145=0, \"N/A\",('Irr Other Crop'!$F$62-'Irr Other Crop'!$F$10+($B145-$B$145)*'Irr Other Crop'!$D$26)/$B145)","v":"N/A"},{"$f":"IF($B145=0, \"N/A\",('Irr Other Crop'!$G$62-'Irr Other Crop'!$G$10+($C145-$C$145)*'Irr Other Crop'!$D$26)/$C145)","v":"N/A"},{"$f":"IF($D145=0, \"N/A\", ('Irr Other Crop'!$H$62-'Irr Other Crop'!$H$10+($D145-$D$145)*'Irr Other Crop'!$D$26)/$D145)","v":"N/A"}]
[{"v":1.1,"d":"110%"},{"$f":"'Irr Other Crop'!$B$9*$A146","v":{"v":0,"d":"0.00"}},{"$f":"'Irr Other Crop'!$B$9*(1-'Irr Other Crop'!$E$9)*$A146","v":{"v":0,"d":"0.00"}},{"$f":"'Irr Other Crop'!$B$9*'Irr Other Crop'!$E$9*$A146","v":{"v":0,"d":"0.00"}},{"$f":"IF($B146=0, \"N/A\", ('Irr Other Crop'!$F$48-'Irr Other Crop'!$F$10+($B146-$B$145)*'Irr Other Crop'!$D$26)/$B146)","v":"N/A"},{"$f":"IF($B146=0, \"N/A\",('Irr Other Crop'!$G$48-'Irr Other Crop'!$G$10+($C146-$C$145)*'Irr Other Crop'!$D$26)/$C146)","v":"N/A"},{"$f":"IF($B146=0, \"N/A\",('Irr Other Crop'!$F$62-'Irr Other Crop'!$F$10+($B146-$B$145)*'Irr Other Crop'!$D$26)/$B146)","v":"N/A"},{"$f":"IF($B146=0, \"N/A\",('Irr Other Crop'!$G$62-'Irr Other Crop'!$G$10+($C146-$C$145)*'Irr Other Crop'!$D$26)/$C146)","v":"N/A"},{"$f":"IF($D146=0, \"N/A\", ('Irr Other Crop'!$H$62-'Irr Other Crop'!$H$10+($D146-$D$145)*'Irr Other Crop'!$D$26)/$D146)","v":"N/A"}]
[{"v":1.25,"d":"125%"},{"$f":"'Irr Other Crop'!$B$9*$A147","v":{"v":0,"d":"0.00"}},{"$f":"'Irr Other Crop'!$B$9*(1-'Irr Other Crop'!$E$9)*$A147","v":{"v":0,"d":"0.00"}},{"$f":"'Irr Other Crop'!$B$9*'Irr Other Crop'!$E$9*$A147","v":{"v":0,"d":"0.00"}},{"$f":"IF($B147=0, \"N/A\", ('Irr Other Crop'!$F$48-'Irr Other Crop'!$F$10+($B147-$B$145)*'Irr Other Crop'!$D$26)/$B147)","v":"N/A"},{"$f":"IF($B147=0, \"N/A\",('Irr Other Crop'!$G$48-'Irr Other Crop'!$G$10+($C147-$C$145)*'Irr Other Crop'!$D$26)/$C147)","v":"N/A"},{"$f":"IF($B147=0, \"N/A\",('Irr Other Crop'!$F$62-'Irr Other Crop'!$F$10+($B147-$B$145)*'Irr Other Crop'!$D$26)/$B147)","v":"N/A"},{"$f":"IF($B147=0, \"N/A\",('Irr Other Crop'!$G$62-'Irr Other Crop'!$G$10+($C147-$C$145)*'Irr Other Crop'!$D$26)/$C147)","v":"N/A"},{"$f":"IF($D147=0, \"N/A\", ('Irr Other Crop'!$H$62-'Irr Other Crop'!$H$10+($D147-$D$145)*'Irr Other Crop'!$D$26)/$D147)","v":"N/A"}]
[]
[{"$f":"'Dry Canola'!$A$3:$H$3","v":"Dryland Canola"}]
[{"$nulls":4},"BE Price to Cover Variable Costs",null,"BE Price to Cover Total Costs"]
["Yield","CWT",null,null,"Total","Tenant","Total","Tenant","Landlord"]
[{"v":0.75,"d":"75%"},{"$f":"'Dry Canola'!$B$9*$A152","v":8.25},{"$f":"'Dry Canola'!$B$9*(1-'Dry Canola'!$E$9)*$A152","v":{"v":5.5275,"d":"5.53"}},{"$f":"'Dry Canola'!$B$9*'Dry Canola'!$E$9*$A152","v":{"v":2.7225,"d":"2.72"}},{"$f":"('Dry Canola'!$F$45+($B152-B$154)*'Dry Canola'!$D$27)/$B152","v":{"v":17.956413495741028,"d":"$17.96"}},{"$f":"('Dry Canola'!$G$45+($C152-C$154)*'Dry Canola'!$D$27)/$C152","v":{"v":24.333571547412145,"d":"$24.33"}},{"$f":"('Dry Canola'!$F$59+($B152-B$154)*'Dry Canola'!$D$27)/$B152","v":{"v":24.403686223013754,"d":"$24.40"}},{"$f":"('Dry Canola'!$G$59+($C152-C$154)*'Dry Canola'!$D$27)/$C152","v":{"v":29.162155898384555,"d":"$29.16"}},{"$f":"IF($D152=0, \"N/A\", ('Dry Canola'!$H$59+($D152-D$154)*'Dry Canola'!$D$27)/$D152)","v":{"v":14.614782856230287,"d":"$14.61"}}]
[{"v":0.9,"d":"90%"},{"$f":"'Dry Canola'!$B$9*$A153","v":{"v":9.9,"d":"9.90"}},{"$f":"'Dry Canola'!$B$9*(1-'Dry Canola'!$E$9)*$A153","v":{"v":6.632999999999999,"d":"6.63"}},{"$f":"'Dry Canola'!$B$9*'Dry Canola'!$E$9*$A153","v":{"v":3.2670000000000003,"d":"3.27"}},{"$f":"('Dry Canola'!$F$45+($B153-B$154)*'Dry Canola'!$D$27)/$B153","v":{"v":15.038677913117523,"d":"$15.04"}},{"$f":"('Dry Canola'!$G$45+($C153-C$154)*'Dry Canola'!$D$27)/$C153","v":{"v":20.352976289510124,"d":"$20.35"}},{"$f":"('Dry Canola'!$F$59+($B153-B$154)*'Dry Canola'!$D$27)/$B153","v":{"v":20.411405185844796,"d":"$20.41"}},{"$f":"('Dry Canola'!$G$59+($C153-C$154)*'Dry Canola'!$D$27)/$C153","v":{"v":24.376796581987133,"d":"$24.38"}},{"$f":"IF($D153=0, \"N/A\", ('Dry Canola'!$H$59+($D153-D$154)*'Dry Canola'!$D$27)/$D153)","v":{"v":12.253985713525237,"d":"$12.25"}}]
[{"v":1,"d":"100%"},{"$f":"'Dry Canola'!$B$9*$A154","v":{"v":11,"d":"11.00"}},{"$f":"'Dry Canola'!$B$9*(1-'Dry Canola'!$E$9)*$A154","v":{"v":7.369999999999999,"d":"7.37"}},{"$f":"'Dry Canola'!$B$9*'Dry Canola'!$E$9*$A154","v":{"v":3.6300000000000003,"d":"3.63"}},{"$f":"('Dry Canola'!$F$45+($B154-B$154)*'Dry Canola'!$D$27)/$B154","v":{"v":13.579810121805771,"d":"$13.58"}},{"$f":"('Dry Canola'!$G$45+($C154-C$154)*'Dry Canola'!$D$27)/$C154","v":{"v":18.362678660559112,"d":"$18.36"}},{"$f":"('Dry Canola'!$F$59+($B154-B$154)*'Dry Canola'!$D$27)/$B154","v":{"v":18.415264667260317,"d":"$18.42"}},{"$f":"('Dry Canola'!$G$59+($C154-C$154)*'Dry Canola'!$D$27)/$C154","v":{"v":21.98411692378842,"d":"$21.98"}},{"$f":"IF($D154=0, \"N/A\", ('Dry Canola'!$H$59+($D154-D$154)*'Dry Canola'!$D$27)/$D154)","v":{"v":11.073587142172714,"d":"$11.07"}}]
[{"v":1.1,"d":"110%"},{"$f":"'Dry Canola'!$B$9*$A155","v":{"v":12.100000000000001,"d":"12.10"}},{"$f":"'Dry Canola'!$B$9*(1-'Dry Canola'!$E$9)*$A155","v":{"v":8.107,"d":"8.11"}},{"$f":"'Dry Canola'!$B$9*'Dry Canola'!$E$9*$A155","v":{"v":3.9930000000000008,"d":"3.99"}},{"$f":"('Dry Canola'!$F$45+($B155-B$154)*'Dry Canola'!$D$27)/$B155","v":{"v":12.386191019823428,"d":"$12.39"}},{"$f":"('Dry Canola'!$G$45+($C155-C$154)*'Dry Canola'!$D$27)/$C155","v":{"v":16.73425332778101,"d":"$16.73"}},{"$f":"('Dry Canola'!$F$59+($B155-B$154)*'Dry Canola'!$D$27)/$B155","v":{"v":16.782058788418468,"d":"$16.78"}},{"$f":"('Dry Canola'!$G$59+($C155-C$154)*'Dry Canola'!$D$27)/$C155","v":{"v":20.026469930716743,"d":"$20.03"}},{"$f":"IF($D155=0, \"N/A\", ('Dry Canola'!$H$59+($D155-D$154)*'Dry Canola'!$D$27)/$D155)","v":{"v":10.107806492884285,"d":"$10.11"}}]
[{"v":1.25,"d":"125%"},{"$f":"'Dry Canola'!$B$9*$A156","v":13.75},{"$f":"'Dry Canola'!$B$9*(1-'Dry Canola'!$E$9)*$A156","v":{"v":9.212499999999999,"d":"9.21"}},{"$f":"'Dry Canola'!$B$9*'Dry Canola'!$E$9*$A156","v":{"v":4.5375000000000005,"d":"4.54"}},{"$f":"('Dry Canola'!$F$45+($B156-B$154)*'Dry Canola'!$D$27)/$B156","v":{"v":10.953848097444618,"d":"$10.95"}},{"$f":"('Dry Canola'!$G$45+($C156-C$154)*'Dry Canola'!$D$27)/$C156","v":{"v":14.78014292844729,"d":"$14.78"}},{"$f":"('Dry Canola'!$F$59+($B156-B$154)*'Dry Canola'!$D$27)/$B156","v":{"v":14.822211733808254,"d":"$14.82"}},{"$f":"('Dry Canola'!$G$59+($C156-C$154)*'Dry Canola'!$D$27)/$C156","v":{"v":17.677293539030735,"d":"$17.68"}},{"$f":"IF($D156=0, \"N/A\", ('Dry Canola'!$H$59+($D156-D$154)*'Dry Canola'!$D$27)/$D156)","v":{"v":8.948869713738171,"d":"$8.95"}}]
[]
[{"$f":"'Dry Cotton'!$A$3:$H$3","v":"Dryland Cotton"}]
[{"$nulls":4},"BE Price to Cover Variable Costs",null,"BE Price to Cover Total Costs"]
["Yield","LB",null,null,"Total","Tenant","Total","Tenant","Landlord"]
[{"v":0.75,"d":"75%"},{"$f":"'Dry Cotton'!$B$9*$A161","v":{"v":300,"d":"300.00"}},{"$f":"'Dry Cotton'!$B$9*(1-'Dry Cotton'!$E$9)*$A161","v":{"v":300,"d":"300.00"}},{"$f":"'Dry Cotton'!$B$9*'Dry Cotton'!$E$9*$A161","v":{"v":0,"d":"0.00"}},{"$f":"('Dry Cotton'!F$49-B161/500*'Universal Input Prices'!$B$39/2000*Cottonseed_Price+(B161-B$163)/100*'Dry Cotton'!$D$30+(B161-B$163)/'Dry Cotton'!$B$11/100*'Dry Cotton'!$D$31)/B161","v":{"v":0.7492207147967009,"d":"$0.75"}},{"$f":"('Dry Cotton'!G$49-C161/500*'Universal Input Prices'!$B$39/2000*Cottonseed_Price+(C161-C$163)/100*'Dry Cotton'!$D$30+(C161-C$163)/'Dry Cotton'!$B$11/100*'Dry Cotton'!$D$31)/C161","v":{"v":0.7473164672086647,"d":"$0.75"}},{"$f":"('Dry Cotton'!F$63-B161/500*'Universal Input Prices'!$B$39/2000*Cottonseed_Price+(B161-B$163)/100*'Dry Cotton'!$D$30+(B161-B$163)/'Dry Cotton'!$B$11/100*'Dry Cotton'!$D$31)/B161","v":{"v":0.9378873814633676,"d":"$0.94"}},{"$f":"('Dry Cotton'!G$63-C161/500*'Universal Input Prices'!$B$39/2000*Cottonseed_Price+(C161-C$163)/100*'Dry Cotton'!$D$30+(C161-C$163)/'Dry Cotton'!$B$11/100*'Dry Cotton'!$D$31)/C161","v":{"v":0.9359831338753314,"d":"$0.94"}},{"$f":"IF($D161=0,\"N/A\",('Dry Cotton'!H$63-D161/500*'Universal Input Prices'!$B$39/2000*Cottonseed_Price+(D161-D$163)/100*'Dry Cotton'!$D$30+(D161-D$163)/'Dry Cotton'!$B$11/100*'Dry Cotton'!$D$31)/D161)","v":"N/A"}]
[{"v":0.9,"d":"90%"},{"$f":"'Dry Cotton'!$B$9*$A162","v":{"v":360,"d":"360.00"}},{"$f":"'Dry Cotton'!$B$9*(1-'Dry Cotton'!$E$9)*$A162","v":{"v":360,"d":"360.00"}},{"$f":"'Dry Cotton'!$B$9*'Dry Cotton'!$E$9*$A162","v":{"v":0,"d":"0.00"}},{"$f":"('Dry Cotton'!F$49-B162/500*'Universal Input Prices'!$B$39/2000*Cottonseed_Price+(B162-B$163)/100*'Dry Cotton'!$D$30+(B162-B$163)/'Dry Cotton'!$B$11/100*'Dry Cotton'!$D$31)/B162","v":{"v":0.6333109917035213,"d":"$0.63"}},{"$f":"('Dry Cotton'!G$49-C162/500*'Universal Input Prices'!$B$39/2000*Cottonseed_Price+(C162-C$163)/100*'Dry Cotton'!$D$30+(C162-C$163)/'Dry Cotton'!$B$11/100*'Dry Cotton'!$D$31)/C162","v":{"v":0.6317241187134912,"d":"$0.63"}},{"$f":"('Dry Cotton'!F$63-B162/500*'Universal Input Prices'!$B$39/2000*Cottonseed_Price+(B162-B$163)/100*'Dry Cotton'!$D$30+(B162-B$163)/'Dry Cotton'!$B$11/100*'Dry Cotton'!$D$31)/B162","v":{"v":0.7905332139257437,"d":"$0.79"}},{"$f":"('Dry Cotton'!G$63-C162/500*'Universal Input Prices'!$B$39/2000*Cottonseed_Price+(C162-C$163)/100*'Dry Cotton'!$D$30+(C162-C$163)/'Dry Cotton'!$B$11/100*'Dry Cotton'!$D$31)/C162","v":{"v":0.7889463409357136,"d":"$0.79"}},{"$f":"IF($D162=0,\"N/A\",('Dry Cotton'!H$63-D162/500*'Universal Input Prices'!$B$39/2000*Cottonseed_Price+(D162-D$163)/100*'Dry Cotton'!$D$30+(D162-D$163)/'Dry Cotton'!$B$11/100*'Dry Cotton'!$D$31)/D162)","v":"N/A"}]
[{"v":1,"d":"100%"},{"$f":"'Dry Cotton'!$B$9*$A163","v":{"v":400,"d":"400.00"}},{"$f":"'Dry Cotton'!$B$9*(1-'Dry Cotton'!$E$9)*$A163","v":{"v":400,"d":"400.00"}},{"$f":"'Dry Cotton'!$B$9*'Dry Cotton'!$E$9*$A163","v":{"v":0,"d":"0.00"}},{"$f":"('Dry Cotton'!F$49-B163/500*'Universal Input Prices'!$B$39/2000*Cottonseed_Price+(B163-B$163)/100*'Dry Cotton'!$D$30+(B163-B$163)/'Dry Cotton'!$B$11/100*'Dry Cotton'!$D$31)/B163","v":{"v":0.5753561301569315,"d":"$0.58"}},{"$f":"('Dry Cotton'!G$49-C163/500*'Universal Input Prices'!$B$39/2000*Cottonseed_Price+(C163-C$163)/100*'Dry Cotton'!$D$30+(C163-C$163)/'Dry Cotton'!$B$11/100*'Dry Cotton'!$D$31)/C163","v":{"v":0.5739279444659044,"d":"$0.57"}},{"$f":"('Dry Cotton'!F$63-B163/500*'Universal Input Prices'!$B$39/2000*Cottonseed_Price+(B163-B$163)/100*'Dry Cotton'!$D$30+(B163-B$163)/'Dry Cotton'!$B$11/100*'Dry Cotton'!$D$31)/B163","v":{"v":0.7168561301569316,"d":"$0.72"}},{"$f":"('Dry Cotton'!G$63-C163/500*'Universal Input Prices'!$B$39/2000*Cottonseed_Price+(C163-C$163)/100*'Dry Cotton'!$D$30+(C163-C$163)/'Dry Cotton'!$B$11/100*'Dry Cotton'!$D$31)/C163","v":{"v":0.7154279444659045,"d":"$0.72"}},{"$f":"IF($D163=0,\"N/A\",('Dry Cotton'!H$63-D163/500*'Universal Input Prices'!$B$39/2000*Cottonseed_Price+(D163-D$163)/100*'Dry Cotton'!$D$30+(D163-D$163)/'Dry Cotton'!$B$11/100*'Dry Cotton'!$D$31)/D163)","v":"N/A"}]
[{"v":1.1,"d":"110%"},{"$f":"'Dry Cotton'!$B$9*$A164","v":{"v":440.00000000000006,"d":"440.00"}},{"$f":"'Dry Cotton'!$B$9*(1-'Dry Cotton'!$E$9)*$A164","v":{"v":440.00000000000006,"d":"440.00"}},{"$f":"'Dry Cotton'!$B$9*'Dry Cotton'!$E$9*$A164","v":{"v":0,"d":"0.00"}},{"$f":"('Dry Cotton'!F$49-B164/500*'Universal Input Prices'!$B$39/2000*Cottonseed_Price+(B164-B$163)/100*'Dry Cotton'!$D$30+(B164-B$163)/'Dry Cotton'!$B$11/100*'Dry Cotton'!$D$31)/B164","v":{"v":0.5279385161642672,"d":"$0.53"}},{"$f":"('Dry Cotton'!G$49-C164/500*'Universal Input Prices'!$B$39/2000*Cottonseed_Price+(C164-C$163)/100*'Dry Cotton'!$D$30+(C164-C$163)/'Dry Cotton'!$B$11/100*'Dry Cotton'!$D$31)/C164","v":{"v":0.5266401655360607,"d":"$0.53"}},{"$f":"('Dry Cotton'!F$63-B164/500*'Universal Input Prices'!$B$39/2000*Cottonseed_Price+(B164-B$163)/100*'Dry Cotton'!$D$30+(B164-B$163)/'Dry Cotton'!$B$11/100*'Dry Cotton'!$D$31)/B164","v":{"v":0.6565748798006309,"d":"$0.66"}},{"$f":"('Dry Cotton'!G$63-C164/500*'Universal Input Prices'!$B$39/2000*Cottonseed_Price+(C164-C$163)/100*'Dry Cotton'!$D$30+(C164-C$163)/'Dry Cotton'!$B$11/100*'Dry Cotton'!$D$31)/C164","v":{"v":0.6552765291724244,"d":"$0.66"}},{"$f":"IF($D164=0,\"N/A\",('Dry Cotton'!H$63-D164/500*'Universal Input Prices'!$B$39/2000*Cottonseed_Price+(D164-D$163)/100*'Dry Cotton'!$D$30+(D164-D$163)/'Dry Cotton'!$B$11/100*'Dry Cotton'!$D$31)/D164)","v":"N/A"}]
[{"v":1.25,"d":"125%"},{"$f":"'Dry Cotton'!$B$9*$A165","v":{"v":500,"d":"500.00"}},{"$f":"'Dry Cotton'!$B$9*(1-'Dry Cotton'!$E$9)*$A165","v":{"v":500,"d":"500.00"}},{"$f":"'Dry Cotton'!$B$9*'Dry Cotton'!$E$9*$A165","v":{"v":0,"d":"0.00"}},{"$f":"('Dry Cotton'!F$49-B165/500*'Universal Input Prices'!$B$39/2000*Cottonseed_Price+(B165-B$163)/100*'Dry Cotton'!$D$30+(B165-B$163)/'Dry Cotton'!$B$11/100*'Dry Cotton'!$D$31)/B165","v":{"v":0.47103737937307,"d":"$0.47"}},{"$f":"('Dry Cotton'!G$49-C165/500*'Universal Input Prices'!$B$39/2000*Cottonseed_Price+(C165-C$163)/100*'Dry Cotton'!$D$30+(C165-C$163)/'Dry Cotton'!$B$11/100*'Dry Cotton'!$D$31)/C165","v":{"v":0.4698948308202483,"d":"$0.47"}},{"$f":"('Dry Cotton'!F$63-B165/500*'Universal Input Prices'!$B$39/2000*Cottonseed_Price+(B165-B$163)/100*'Dry Cotton'!$D$30+(B165-B$163)/'Dry Cotton'!$B$11/100*'Dry Cotton'!$D$31)/B165","v":{"v":0.5842373793730701,"d":"$0.58"}},{"$f":"('Dry Cotton'!G$63-C165/500*'Universal Input Prices'!$B$39/2000*Cottonseed_Price+(C165-C$163)/100*'Dry Cotton'!$D$30+(C165-C$163)/'Dry Cotton'!$B$11/100*'Dry Cotton'!$D$31)/C165","v":{"v":0.5830948308202484,"d":"$0.58"}},{"$f":"IF($D165=0,\"N/A\",('Dry Cotton'!H$63-D165/500*'Universal Input Prices'!$B$39/2000*Cottonseed_Price+(D165-D$163)/100*'Dry Cotton'!$D$30+(D165-D$163)/'Dry Cotton'!$B$11/100*'Dry Cotton'!$D$31)/D165)","v":"N/A"}]
[]
[{"$f":"'Dry Sorghum'!$A$3:$H$3","v":"Dryland Sorghum"}]
[{"$nulls":4},"BE Price to Cover Variable Costs",null,"BE Price to Cover Total Costs"]
["Yield","CWT",null,null,"Total","Tenant","Total","Tenant","Landlord"]
[{"v":0.75,"d":"75%"},{"$f":"'Dry Sorghum'!$B$9*$A170","v":18.75},{"$f":"'Dry Sorghum'!$B$9*(1-'Dry Sorghum'!$E$9)*$A170","v":18.75},{"$f":"'Dry Sorghum'!$B$9*'Dry Sorghum'!$E$9*$A170","v":{"v":0,"d":"0.00"}},{"$f":"('Dry Sorghum'!$F$43-'Irr Sorghum'!$F$10+($B170-B$172)*'Dry Sorghum'!$D$25)/$B170","v":{"v":8.26716276498356,"d":"$8.27"}},{"$f":"('Dry Sorghum'!$G$43-'Irr Sorghum'!$F$10+($C170-C$172)*'Dry Sorghum'!$D$25)/$C170","v":{"v":7.938168959420715,"d":"$7.94"}},{"$f":"('Dry Sorghum'!$F$57-'Irr Sorghum'!$F$10+($B170-B$172)*'Dry Sorghum'!$D$25)/$B170","v":{"v":11.020762764983559,"d":"$11.02"}},{"$f":"('Dry Sorghum'!$G$57-'Irr Sorghum'!$F$10+($C170-C$172)*'Dry Sorghum'!$D$25)/$C170","v":{"v":10.691768959420715,"d":"$10.69"}},{"$f":"IF($D170=0, \"N/A\", ('Dry Sorghum'!$H$57-'Irr Sorghum'!$F$10+($D170-D$172)*'Dry Sorghum'!$D$25)/$D170)","v":"N/A"}]
[{"v":0.9,"d":"90%"},{"$f":"'Dry Sorghum'!$B$9*$A171","v":{"v":22.5,"d":"22.50"}},{"$f":"'Dry Sorghum'!$B$9*(1-'Dry Sorghum'!$E$9)*$A171","v":{"v":22.5,"d":"22.50"}},{"$f":"'Dry Sorghum'!$B$9*'Dry Sorghum'!$E$9*$A171","v":{"v":0,"d":"0.00"}},{"$f":"('Dry Sorghum'!$F$43-'Irr Sorghum'!$F$10+($B171-B$172)*'Dry Sorghum'!$D$25)/$B171","v":{"v":6.930968970819633,"d":"$6.93"}},{"$f":"('Dry Sorghum'!$G$43-'Irr Sorghum'!$F$10+($C171-C$172)*'Dry Sorghum'!$D$25)/$C171","v":{"v":6.656807466183929,"d":"$6.66"}},{"$f":"('Dry Sorghum'!$F$57-'Irr Sorghum'!$F$10+($B171-B$172)*'Dry Sorghum'!$D$25)/$B171","v":{"v":9.225635637486299,"d":"$9.23"}},{"$f":"('Dry Sorghum'!$G$57-'Irr Sorghum'!$F$10+($C171-C$172)*'Dry Sorghum'!$D$25)/$C171","v":{"v":8.951474132850596,"d":"$8.95"}},{"$f":"IF($D171=0, \"N/A\", ('Dry Sorghum'!$H$57-'Irr Sorghum'!$F$10+($D171-D$172)*'Dry Sorghum'!$D$25)/$D171)","v":"N/A"}]
[{"v":1,"d":"100%"},{"$f":"'Dry Sorghum'!$B$9*$A172","v":{"v":25,"d":"25.00"}},{"$f":"'Dry Sorghum'!$B$9*(1-'Dry Sorghum'!$E$9)*$A172","v":{"v":25,"d":"25.00"}},{"$f":"'Dry Sorghum'!$B$9*'Dry Sorghum'!$E$9*$A172","v":{"v":0,"d":"0.00"}},{"$f":"('Dry Sorghum'!$F$43-'Irr Sorghum'!$F$10+($B172-B$172)*'Dry Sorghum'!$D$25)/$B172","v":{"v":6.262872073737669,"d":"$6.26"}},{"$f":"('Dry Sorghum'!$G$43-'Irr Sorghum'!$F$10+($C172-C$172)*'Dry Sorghum'!$D$25)/$C172","v":{"v":6.016126719565537,"d":"$6.02"}},{"$f":"('Dry Sorghum'!$F$57-'Irr Sorghum'!$F$10+($B172-B$172)*'Dry Sorghum'!$D$25)/$B172","v":{"v":8.328072073737669,"d":"$8.33"}},{"$f":"('Dry Sorghum'!$G$57-'Irr Sorghum'!$F$10+($C172-C$172)*'Dry Sorghum'!$D$25)/$C172","v":{"v":8.081326719565537,"d":"$8.08"}},{"$f":"IF($D172=0, \"N/A\", ('Dry Sorghum'!$H$57-'Irr Sorghum'!$F$10+($D172-D$172)*'Dry Sorghum'!$D$25)/$D172)","v":"N/A"}]
[{"v":1.1,"d":"110%"},{"$f":"'Dry Sorghum'!$B$9*$A173","v":{"v":27.500000000000004,"d":"27.50"}},{"$f":"'Dry Sorghum'!$B$9*(1-'Dry Sorghum'!$E$9)*$A173","v":{"v":27.500000000000004,"d":"27.50"}},{"$f":"'Dry Sorghum'!$B$9*'Dry Sorghum'!$E$9*$A173","v":{"v":0,"d":"0.00"}},{"$f":"('Dry Sorghum'!$F$43-'Irr Sorghum'!$F$10+($B173-B$172)*'Dry Sorghum'!$D$25)/$B173","v":{"v":5.716247339761517,"d":"$5.72"}},{"$f":"('Dry Sorghum'!$G$43-'Irr Sorghum'!$F$10+($C173-C$172)*'Dry Sorghum'!$D$25)/$C173","v":{"v":5.491933381423214,"d":"$5.49"}},{"$f":"('Dry Sorghum'!$F$57-'Irr Sorghum'!$F$10+($B173-B$172)*'Dry Sorghum'!$D$25)/$B173","v":{"v":7.593701885216062,"d":"$7.59"}},{"$f":"('Dry Sorghum'!$G$57-'Irr Sorghum'!$F$10+($C173-C$172)*'Dry Sorghum'!$D$25)/$C173","v":{"v":7.369387926877759,"d":"$7.37"}},{"$f":"IF($D173=0, \"N/A\", ('Dry Sorghum'!$H$57-'Irr Sorghum'!$F$10+($D173-D$172)*'Dry Sorghum'!$D$25)/$D173)","v":"N/A"}]
[{"v":1.25,"d":"125%"},{"$f":"'Dry Sorghum'!$B$9*$A174","v":31.25},{"$f":"'Dry Sorghum'!$B$9*(1-'Dry Sorghum'!$E$9)*$A174","v":31.25},{"$f":"'Dry Sorghum'!$B$9*'Dry Sorghum'!$E$9*$A174","v":{"v":0,"d":"0.00"}},{"$f":"('Dry Sorghum'!$F$43-'Irr Sorghum'!$F$10+($B174-B$172)*'Dry Sorghum'!$D$25)/$B174","v":{"v":5.060297658990136,"d":"$5.06"}},{"$f":"('Dry Sorghum'!$G$43-'Irr Sorghum'!$F$10+($C174-C$172)*'Dry Sorghum'!$D$25)/$C174","v":{"v":4.862901375652429,"d":"$4.86"}},{"$f":"('Dry Sorghum'!$F$57-'Irr Sorghum'!$F$10+($B174-B$172)*'Dry Sorghum'!$D$25)/$B174","v":{"v":6.712457658990135,"d":"$6.71"}},{"$f":"('Dry Sorghum'!$G$57-'Irr Sorghum'!$F$10+($C174-C$172)*'Dry Sorghum'!$D$25)/$C174","v":{"v":6.515061375652429,"d":"$6.52"}},{"$f":"IF($D174=0, \"N/A\", ('Dry Sorghum'!$H$57-'Irr Sorghum'!$F$10+($D174-D$172)*'Dry Sorghum'!$D$25)/$D174)","v":"N/A"}]
[]
[{"$f":"'Dry Sorghum Sudangrass'!$A$3:$H$3","v":"Dryland Sorghum Sudangrass"}]
[{"$nulls":4},"BE Price to Cover Variable Costs",null,"BE Price to Cover Total Costs"]
["Yield","LB",null,null,"Total","Tenant","Total","Tenant","Landlord"]
[{"v":0.75,"d":"75%"},{"$f":"'Dry Sorghum Sudangrass'!$B$9*$A179","v":{"v":252,"d":"252.00"}},{"$f":"'Dry Sorghum Sudangrass'!$B$9*(1-'Dry Sorghum Sudangrass'!$E$9)*$A179","v":{"v":168.83999999999997,"d":"168.84"}},{"$f":"'Dry Sorghum Sudangrass'!$B$9*'Dry Sorghum Sudangrass'!$E$9*$A179","v":{"v":83.16000000000001,"d":"83.16"}},{"$f":"('Dry Sorghum Sudangrass'!$F$42+($B179-B$181)*'Dry Sorghum Sudangrass'!$D$24)/$B179","v":{"v":0.436089892180557,"d":"$0.44"}},{"$f":"('Dry Sorghum Sudangrass'!$G$42+($C179-C$181)*'Dry Sorghum Sudangrass'!$D$24)/$C179","v":{"v":0.5374779992509949,"d":"$0.54"}},{"$f":"('Dry Sorghum Sudangrass'!$F$56+($B179-B$181)*'Dry Sorghum Sudangrass'!$D$24)/$B179","v":{"v":0.6362089397996046,"d":"$0.64"}},{"$f":"('Dry Sorghum Sudangrass'!$G$56+($C179-C$181)*'Dry Sorghum Sudangrass'!$D$24)/$C179","v":{"v":0.6792098163559463,"d":"$0.68"}},{"$f":"IF($D179=0, \"N/A\", ('Dry Sorghum Sudangrass'!$H$56+($D179-D$181)*'Dry Sorghum Sudangrass'!$D$24)/$D179)","v":{"v":0.5574810726310726,"d":"$0.56"}}]
[{"v":0.9,"d":"90%"},{"$f":"'Dry Sorghum Sudangrass'!$B$9*$A180","v":{"v":302.40000000000003,"d":"302.40"}},{"$f":"'Dry Sorghum Sudangrass'!$B$9*(1-'Dry Sorghum Sudangrass'!$E$9)*$A180","v":{"v":202.60799999999998,"d":"202.61"}},{"$f":"'Dry Sorghum Sudangrass'!$B$9*'Dry Sorghum Sudangrass'!$E$9*$A180","v":{"v":99.79200000000002,"d":"99.79"}},{"$f":"('Dry Sorghum Sudangrass'!$F$42+($B180-B$181)*'Dry Sorghum Sudangrass'!$D$24)/$B180","v":{"v":0.36340824348379747,"d":"$0.36"}},{"$f":"('Dry Sorghum Sudangrass'!$G$42+($C180-C$181)*'Dry Sorghum Sudangrass'!$D$24)/$C180","v":{"v":0.4478983327091624,"d":"$0.45"}},{"$f":"('Dry Sorghum Sudangrass'!$F$56+($B180-B$181)*'Dry Sorghum Sudangrass'!$D$24)/$B180","v":{"v":0.5301741164996705,"d":"$0.53"}},{"$f":"('Dry Sorghum Sudangrass'!$G$56+($C180-C$181)*'Dry Sorghum Sudangrass'!$D$24)/$C180","v":{"v":0.5660081802966219,"d":"$0.57"}},{"$f":"IF($D180=0, \"N/A\", ('Dry Sorghum Sudangrass'!$H$56+($D180-D$181)*'Dry Sorghum Sudangrass'!$D$24)/$D180)","v":{"v":0.4645675605258938,"d":"$0.46"}}]
[{"v":1,"d":"100%"},{"$f":"'Dry Sorghum Sudangrass'!$B$9*$A181","v":{"v":336,"d":"336.00"}},{"$f":"'Dry Sorghum Sudangrass'!$B$9*(1-'Dry Sorghum Sudangrass'!$E$9)*$A181","v":{"v":225.11999999999998,"d":"225.12"}},{"$f":"'Dry Sorghum Sudangrass'!$B$9*'Dry Sorghum Sudangrass'!$E$9*$A181","v":{"v":110.88000000000001,"d":"110.88"}},{"$f":"('Dry Sorghum Sudangrass'!$F$42+($B181-B$181)*'Dry Sorghum Sudangrass'!$D$24)/$B181","v":{"v":0.32706741913541776,"d":"$0.33"}},{"$f":"('Dry Sorghum Sudangrass'!$G$42+($C181-C$181)*'Dry Sorghum Sudangrass'!$D$24)/$C181","v":{"v":0.40310849943824617,"d":"$0.40"}},{"$f":"('Dry Sorghum Sudangrass'!$F$56+($B181-B$181)*'Dry Sorghum Sudangrass'!$D$24)/$B181","v":{"v":0.47715670484970346,"d":"$0.48"}},{"$f":"('Dry Sorghum Sudangrass'!$G$56+($C181-C$181)*'Dry Sorghum Sudangrass'!$D$24)/$C181","v":{"v":0.5094073622669597,"d":"$0.51"}},{"$f":"IF($D181=0, \"N/A\", ('Dry Sorghum Sudangrass'!$H$56+($D181-D$181)*'Dry Sorghum Sudangrass'!$D$24)/$D181)","v":{"v":0.41811080447330445,"d":"$0.42"}}]
[{"v":1.1,"d":"110%"},{"$f":"'Dry Sorghum Sudangrass'!$B$9*$A182","v":{"v":369.6,"d":"369.60"}},{"$f":"'Dry Sorghum Sudangrass'!$B$9*(1-'Dry Sorghum Sudangrass'!$E$9)*$A182","v":{"v":247.632,"d":"247.63"}},{"$f":"'Dry Sorghum Sudangrass'!$B$9*'Dry Sorghum Sudangrass'!$E$9*$A182","v":{"v":121.96800000000002,"d":"121.97"}},{"$f":"('Dry Sorghum Sudangrass'!$F$42+($B182-B$181)*'Dry Sorghum Sudangrass'!$D$24)/$B182","v":{"v":0.29733401739583426,"d":"$0.30"}},{"$f":"('Dry Sorghum Sudangrass'!$G$42+($C182-C$181)*'Dry Sorghum Sudangrass'!$D$24)/$C182","v":{"v":0.3664622722165874,"d":"$0.37"}},{"$f":"('Dry Sorghum Sudangrass'!$F$56+($B182-B$181)*'Dry Sorghum Sudangrass'!$D$24)/$B182","v":{"v":0.4337788225906395,"d":"$0.43"}},{"$f":"('Dry Sorghum Sudangrass'!$G$56+($C182-C$181)*'Dry Sorghum Sudangrass'!$D$24)/$C182","v":{"v":0.4630976020608724,"d":"$0.46"}},{"$f":"IF($D182=0, \"N/A\", ('Dry Sorghum Sudangrass'!$H$56+($D182-D$181)*'Dry Sorghum Sudangrass'!$D$24)/$D182)","v":{"v":0.38010073133936767,"d":"$0.38"}}]
[{"v":1.25,"d":"125%"},{"$f":"'Dry Sorghum Sudangrass'!$B$9*$A183","v":{"v":420,"d":"420.00"}},{"$f":"'Dry Sorghum Sudangrass'!$B$9*(1-'Dry Sorghum Sudangrass'!$E$9)*$A183","v":{"v":281.4,"d":"281.40"}},{"$f":"'Dry Sorghum Sudangrass'!$B$9*'Dry Sorghum Sudangrass'!$E$9*$A183","v":{"v":138.60000000000002,"d":"138.60"}},{"$f":"('Dry Sorghum Sudangrass'!$F$42+($B183-B$181)*'Dry Sorghum Sudangrass'!$D$24)/$B183","v":{"v":0.2616539353083342,"d":"$0.26"}},{"$f":"('Dry Sorghum Sudangrass'!$G$42+($C183-C$181)*'Dry Sorghum Sudangrass'!$D$24)/$C183","v":{"v":0.32248679955059695,"d":"$0.32"}},{"$f":"('Dry Sorghum Sudangrass'!$F$56+($B183-B$181)*'Dry Sorghum Sudangrass'!$D$24)/$B183","v":{"v":0.3817253638797628,"d":"$0.38"}},{"$f":"('Dry Sorghum Sudangrass'!$G$56+($C183-C$181)*'Dry Sorghum Sudangrass'!$D$24)/$C183","v":{"v":0.40752588981356774,"d":"$0.41"}},{"$f":"IF($D183=0, \"N/A\", ('Dry Sorghum Sudangrass'!$H$56+($D183-D$181)*'Dry Sorghum Sudangrass'!$D$24)/$D183)","v":{"v":0.33448864357864355,"d":"$0.33"}}]
[]
[{"$f":"'Dry Sunflowers-Oilseed'!$A$3:$H$3","v":"Dryland Sunflowers-Oilseed "}]
[{"$nulls":4},"BE Price to Cover Variable Costs",null,"BE Price to Cover Total Costs"]
["Yield","CWT",null,null,"Total","Tenant","Total","Tenant","Landlord"]
[{"v":0.75,"d":"75%"},{"$f":"'Dry Sunflowers-Oilseed'!$B$9*$A188","v":{"v":7.5,"d":"7.50"}},{"$f":"'Dry Sunflowers-Oilseed'!$B$9*(1-'Dry Sunflowers-Oilseed'!$E$9)*$A188","v":{"v":5.0249999999999995,"d":"5.03"}},{"$f":"'Dry Sunflowers-Oilseed'!$B$9*'Dry Sunflowers-Oilseed'!$E$9*$A188","v":{"v":2.475,"d":"2.48"}},{"$f":"('Dry Sunflowers-Oilseed'!$F$44+($B188-B$190)*'Dry Sunflowers-Oilseed'!$D$25)/$B188","v":{"v":20.13842002914867,"d":"$20.14"}},{"$f":"('Dry Sunflowers-Oilseed'!$G$44+($C188-C$190)*'Dry Sunflowers-Oilseed'!$D$25)/$C188","v":{"v":24.93032892657473,"d":"$24.93"}},{"$f":"('Dry Sunflowers-Oilseed'!$F$58+($B188-B$190)*'Dry Sunflowers-Oilseed'!$D$25)/$B188","v":{"v":26.683753362482,"d":"$26.68"}},{"$f":"('Dry Sunflowers-Oilseed'!$G$58+($C188-C$190)*'Dry Sunflowers-Oilseed'!$D$25)/$C188","v":{"v":29.425851314634436,"d":"$29.43"}},{"$f":"IF($D188=0, \"N/A\", ('Dry Sunflowers-Oilseed'!$H$58+($D188-D$190)*'Dry Sunflowers-Oilseed'!$D$25)/$D188)","v":{"v":21.334579873737376,"d":"$21.33"}}]
[{"v":0.9,"d":"90%"},{"$f":"'Dry Sunflowers-Oilseed'!$B$9*$A189","v":{"v":9,"d":"9.00"}},{"$f":"'Dry Sunflowers-Oilseed'!$B$9*(1-'Dry Sunflowers-Oilseed'!$E$9)*$A189","v":{"v":6.029999999999999,"d":"6.03"}},{"$f":"'Dry Sunflowers-Oilseed'!$B$9*'Dry Sunflowers-Oilseed'!$E$9*$A189","v":2.97},{"$f":"('Dry Sunflowers-Oilseed'!$F$44+($B189-B$190)*'Dry Sunflowers-Oilseed'!$D$25)/$B189","v":{"v":16.857016690957224,"d":"$16.86"}},{"$f":"('Dry Sunflowers-Oilseed'!$G$44+($C189-C$190)*'Dry Sunflowers-Oilseed'!$D$25)/$C189","v":{"v":20.850274105478942,"d":"$20.85"}},{"$f":"('Dry Sunflowers-Oilseed'!$F$58+($B189-B$190)*'Dry Sunflowers-Oilseed'!$D$25)/$B189","v":{"v":22.31146113540167,"d":"$22.31"}},{"$f":"('Dry Sunflowers-Oilseed'!$G$58+($C189-C$190)*'Dry Sunflowers-Oilseed'!$D$25)/$C189","v":{"v":24.59654276219536,"d":"$24.60"}},{"$f":"IF($D189=0, \"N/A\", ('Dry Sunflowers-Oilseed'!$H$58+($D189-D$190)*'Dry Sunflowers-Oilseed'!$D$25)/$D189)","v":{"v":17.85381656144781,"d":"$17.85"}}]
[{"v":1,"d":"100%"},{"$f":"'Dry Sunflowers-Oilseed'!$B$9*$A190","v":{"v":10,"d":"10.00"}},{"$f":"'Dry Sunflowers-Oilseed'!$B$9*(1-'Dry Sunflowers-Oilseed'!$E$9)*$A190","v":{"v":6.699999999999999,"d":"6.70"}},{"$f":"'Dry Sunflowers-Oilseed'!$B$9*'Dry Sunflowers-Oilseed'!$E$9*$A190","v":{"v":3.3000000000000003,"d":"3.30"}},{"$f":"('Dry Sunflowers-Oilseed'!$F$44+($B190-B$190)*'Dry Sunflowers-Oilseed'!$D$25)/$B190","v":{"v":15.2163150218615,"d":"$15.22"}},{"$f":"('Dry Sunflowers-Oilseed'!$G$44+($C190-C$190)*'Dry Sunflowers-Oilseed'!$D$25)/$C190","v":{"v":18.81024669493105,"d":"$18.81"}},{"$f":"('Dry Sunflowers-Oilseed'!$F$58+($B190-B$190)*'Dry Sunflowers-Oilseed'!$D$25)/$B190","v":{"v":20.125315021861503,"d":"$20.13"}},{"$f":"('Dry Sunflowers-Oilseed'!$G$58+($C190-C$190)*'Dry Sunflowers-Oilseed'!$D$25)/$C190","v":{"v":22.181888485975826,"d":"$22.18"}},{"$f":"IF($D190=0, \"N/A\", ('Dry Sunflowers-Oilseed'!$H$58+($D190-D$190)*'Dry Sunflowers-Oilseed'!$D$25)/$D190)","v":{"v":16.11343490530303,"d":"$16.11"}}]
[{"v":1.1,"d":"110%"},{"$f":"'Dry Sunflowers-Oilseed'!$B$9*$A191","v":{"v":11,"d":"11.00"}},{"$f":"'Dry Sunflowers-Oilseed'!$B$9*(1-'Dry Sunflowers-Oilseed'!$E$9)*$A191","v":7.37},{"$f":"'Dry Sunflowers-Oilseed'!$B$9*'Dry Sunflowers-Oilseed'!$E$9*$A191","v":{"v":3.630000000000001,"d":"3.63"}},{"$f":"('Dry Sunflowers-Oilseed'!$F$44+($B191-B$190)*'Dry Sunflowers-Oilseed'!$D$25)/$B191","v":{"v":13.87392274714682,"d":"$13.87"}},{"$f":"('Dry Sunflowers-Oilseed'!$G$44+($C191-C$190)*'Dry Sunflowers-Oilseed'!$D$25)/$C191","v":{"v":17.141133359028224,"d":"$17.14"}},{"$f":"('Dry Sunflowers-Oilseed'!$F$58+($B191-B$190)*'Dry Sunflowers-Oilseed'!$D$25)/$B191","v":{"v":18.336650019874092,"d":"$18.34"}},{"$f":"('Dry Sunflowers-Oilseed'!$G$58+($C191-C$190)*'Dry Sunflowers-Oilseed'!$D$25)/$C191","v":{"v":20.206262259978022,"d":"$20.21"}},{"$f":"IF($D191=0, \"N/A\", ('Dry Sunflowers-Oilseed'!$H$58+($D191-D$190)*'Dry Sunflowers-Oilseed'!$D$25)/$D191)","v":{"v":14.689486277548207,"d":"$14.69"}}]
[{"v":1.25,"d":"125%"},{"$f":"'Dry Sunflowers-Oilseed'!$B$9*$A192","v":{"v":12.5,"d":"12.50"}},{"$f":"'Dry Sunflowers-Oilseed'!$B$9*(1-'Dry Sunflowers-Oilseed'!$E$9)*$A192","v":{"v":8.375,"d":"8.38"}},{"$f":"'Dry Sunflowers-Oilseed'!$B$9*'Dry Sunflowers-Oilseed'!$E$9*$A192","v":{"v":4.125,"d":"4.13"}},{"$f":"('Dry Sunflowers-Oilseed'!$F$44+($B192-B$190)*'Dry Sunflowers-Oilseed'!$D$25)/$B192","v":{"v":12.263052017489201,"d":"$12.26"}},{"$f":"('Dry Sunflowers-Oilseed'!$G$44+($C192-C$190)*'Dry Sunflowers-Oilseed'!$D$25)/$C192","v":{"v":15.138197355944836,"d":"$15.14"}},{"$f":"('Dry Sunflowers-Oilseed'!$F$58+($B192-B$190)*'Dry Sunflowers-Oilseed'!$D$25)/$B192","v":{"v":16.1902520174892,"d":"$16.19"}},{"$f":"('Dry Sunflowers-Oilseed'!$G$58+($C192-C$190)*'Dry Sunflowers-Oilseed'!$D$25)/$C192","v":{"v":17.835510788780656,"d":"$17.84"}},{"$f":"IF($D192=0, \"N/A\", ('Dry Sunflowers-Oilseed'!$H$58+($D192-D$190)*'Dry Sunflowers-Oilseed'!$D$25)/$D192)","v":{"v":12.980747924242426,"d":"$12.98"}}]
[]
[{"$f":"'Dry Wheat'!$A$3:$H$3","v":"Dryland Wheat"}]
[{"$nulls":4},"BE Price to Cover Variable Costs",null,"BE Price to Cover Total Costs"]
["Yield","CWT",null,null,"Total","Tenant","Total","Tenant","Landlord"]
[{"v":0.75,"d":"75%"},{"$f":"'Dry Wheat'!$B$9*$A197","v":{"v":15,"d":"15.00"}},{"$f":"'Dry Wheat'!$B$9*(1-'Dry Wheat'!$E$9)*$A197","v":{"v":10.049999999999999,"d":"10.05"}},{"$f":"'Dry Wheat'!$B$9*'Dry Wheat'!$E$9*$A197","v":4.95},{"$f":"('Dry Wheat'!$F$44+($B197-B$199)*'Dry Wheat'!$D$26)/$B197","v":{"v":7.3735140556862735,"d":"$7.37"}},{"$f":"('Dry Wheat'!$G$44+($C197-C$199)*'Dry Wheat'!$D$26)/$C197","v":{"v":9.74408842885572,"d":"$9.74"}},{"$f":"('Dry Wheat'!$F$58+($B197-B$199)*'Dry Wheat'!$D$26)/$B197","v":{"v":10.918847389019607,"d":"$10.92"}},{"$f":"('Dry Wheat'!$G$58+($C197-C$199)*'Dry Wheat'!$D$26)/$C197","v":{"v":12.398814797014925,"d":"$12.40"}},{"$f":"IF($D197=0, \"N/A\", ('Dry Wheat'!$H$58+($D197-D$199)*'Dry Wheat'!$D$26)/$D197)","v":{"v":7.83770202020202,"d":"$7.84"}}]
[{"v":0.9,"d":"90%"},{"$f":"'Dry Wheat'!$B$9*$A198","v":{"v":18,"d":"18.00"}},{"$f":"'Dry Wheat'!$B$9*(1-'Dry Wheat'!$E$9)*$A198","v":{"v":12.059999999999999,"d":"12.06"}},{"$f":"'Dry Wheat'!$B$9*'Dry Wheat'!$E$9*$A198","v":5.94},{"$f":"('Dry Wheat'!$F$44+($B198-B$199)*'Dry Wheat'!$D$26)/$B198","v":{"v":6.186261713071895,"d":"$6.19"}},{"$f":"('Dry Wheat'!$G$44+($C198-C$199)*'Dry Wheat'!$D$26)/$C198","v":{"v":8.161740357379768,"d":"$8.16"}},{"$f":"('Dry Wheat'!$F$58+($B198-B$199)*'Dry Wheat'!$D$26)/$B198","v":{"v":9.14070615751634,"d":"$9.14"}},{"$f":"('Dry Wheat'!$G$58+($C198-C$199)*'Dry Wheat'!$D$26)/$C198","v":{"v":10.37401233084577,"d":"$10.37"}},{"$f":"IF($D198=0, \"N/A\", ('Dry Wheat'!$H$58+($D198-D$199)*'Dry Wheat'!$D$26)/$D198)","v":{"v":6.573085016835017,"d":"$6.57"}}]
[{"v":1,"d":"100%"},{"$f":"'Dry Wheat'!$B$9*$A199","v":{"v":20,"d":"20.00"}},{"$f":"'Dry Wheat'!$B$9*(1-'Dry Wheat'!$E$9)*$A199","v":{"v":13.399999999999999,"d":"13.40"}},{"$f":"'Dry Wheat'!$B$9*'Dry Wheat'!$E$9*$A199","v":{"v":6.6000000000000005,"d":"6.60"}},{"$f":"('Dry Wheat'!$F$44+($B199-B$199)*'Dry Wheat'!$D$26)/$B199","v":{"v":5.592635541764706,"d":"$5.59"}},{"$f":"('Dry Wheat'!$G$44+($C199-C$199)*'Dry Wheat'!$D$26)/$C199","v":{"v":7.370566321641791,"d":"$7.37"}},{"$f":"('Dry Wheat'!$F$58+($B199-B$199)*'Dry Wheat'!$D$26)/$B199","v":{"v":8.251635541764704,"d":"$8.25"}},{"$f":"('Dry Wheat'!$G$58+($C199-C$199)*'Dry Wheat'!$D$26)/$C199","v":{"v":9.361611097761193,"d":"$9.36"}},{"$f":"IF($D199=0, \"N/A\", ('Dry Wheat'!$H$58+($D199-D$199)*'Dry Wheat'!$D$26)/$D199)","v":{"v":5.940776515151515,"d":"$5.94"}}]
[{"v":1.1,"d":"110%"},{"$f":"'Dry Wheat'!$B$9*$A200","v":{"v":22,"d":"22.00"}},{"$f":"'Dry Wheat'!$B$9*(1-'Dry Wheat'!$E$9)*$A200","v":14.74},{"$f":"'Dry Wheat'!$B$9*'Dry Wheat'!$E$9*$A200","v":{"v":7.260000000000002,"d":"7.26"}},{"$f":"('Dry Wheat'!$F$44+($B200-B$199)*'Dry Wheat'!$D$26)/$B200","v":{"v":5.106941401604278,"d":"$5.11"}},{"$f":"('Dry Wheat'!$G$44+($C200-C$199)*'Dry Wheat'!$D$26)/$C200","v":{"v":6.7232421105834455,"d":"$6.72"}},{"$f":"('Dry Wheat'!$F$58+($B200-B$199)*'Dry Wheat'!$D$26)/$B200","v":{"v":7.524214128877005,"d":"$7.52"}},{"$f":"('Dry Wheat'!$G$58+($C200-C$199)*'Dry Wheat'!$D$26)/$C200","v":{"v":8.533282816146539,"d":"$8.53"}},{"$f":"IF($D200=0, \"N/A\", ('Dry Wheat'!$H$58+($D200-D$199)*'Dry Wheat'!$D$26)/$D200)","v":{"v":5.423433195592286,"d":"$5.42"}}]
[{"v":1.25,"d":"125%"},{"$f":"'Dry Wheat'!$B$9*$A201","v":{"v":25,"d":"25.00"}},{"$f":"'Dry Wheat'!$B$9*(1-'Dry Wheat'!$E$9)*$A201","v":16.75},{"$f":"'Dry Wheat'!$B$9*'Dry Wheat'!$E$9*$A201","v":8.25},{"$f":"('Dry Wheat'!$F$44+($B201-B$199)*'Dry Wheat'!$D$26)/$B201","v":{"v":4.524108433411764,"d":"$4.52"}},{"$f":"('Dry Wheat'!$G$44+($C201-C$199)*'Dry Wheat'!$D$26)/$C201","v":{"v":5.946453057313432,"d":"$5.95"}},{"$f":"('Dry Wheat'!$F$58+($B201-B$199)*'Dry Wheat'!$D$26)/$B201","v":{"v":6.651308433411764,"d":"$6.65"}},{"$f":"('Dry Wheat'!$G$58+($C201-C$199)*'Dry Wheat'!$D$26)/$C201","v":{"v":7.539288878208954,"d":"$7.54"}},{"$f":"IF($D201=0, \"N/A\", ('Dry Wheat'!$H$58+($D201-D$199)*'Dry Wheat'!$D$26)/$D201)","v":{"v":4.802621212121212,"d":"$4.80"}}]
[]
[{"$f":"'Dry Other Crop'!$A$3:$H$3","v":"Dryland Other Crop"}]
[{"$nulls":4},"BE Price to Cover Variable Costs",null,"BE Price to Cover Total Costs"]
["Yield","LB",null,null,"Total","Tenant","Total","Tenant","Landlord"]
[{"v":0.75,"d":"75%"},{"$f":"'Dry Other Crop'!$B$9*$A206","v":{"v":0,"d":"0.00"}},{"$f":"'Dry Other Crop'!$B$9*(1-'Dry Other Crop'!$E$9)*$A206","v":{"v":0,"d":"0.00"}},{"$f":"'Dry Other Crop'!$B$9*'Dry Other Crop'!$E$9*$A206","v":{"v":0,"d":"0.00"}},{"$f":"IF($B206=0, \"N/A\", ('Dry Other Crop'!$F$44-'Dry Other Crop'!$F$10+($B206-$B$208)*'Dry Other Crop'!$D$26)/$B206)","v":"N/A"},{"$f":"IF($B206=0, \"N/A\",('Dry Other Crop'!$G$44-'Dry Other Crop'!$G$10+($C206-$C$208)*'Dry Other Crop'!$D$26)/$C206)","v":"N/A"},{"$f":"IF($B206=0, \"N/A\",('Dry Other Crop'!$F$58-'Dry Other Crop'!$F$10+($B206-$B$208)*'Dry Other Crop'!$D$26)/$B206)","v":"N/A"},{"$f":"IF($B206=0, \"N/A\",('Dry Other Crop'!$G$58-'Dry Other Crop'!$G$10+($C206-$C$208)*'Dry Other Crop'!$D$26)/$C206)","v":"N/A"},{"$f":"IF($D206=0, \"N/A\", ('Dry Other Crop'!$H$58-'Dry Other Crop'!$H$10+($D206-$D$208)*'Dry Other Crop'!$D$26)/$D206)","v":"N/A"}]
[{"v":0.9,"d":"90%"},{"$f":"'Dry Other Crop'!$B$9*$A207","v":{"v":0,"d":"0.00"}},{"$f":"'Dry Other Crop'!$B$9*(1-'Dry Other Crop'!$E$9)*$A207","v":{"v":0,"d":"0.00"}},{"$f":"'Dry Other Crop'!$B$9*'Dry Other Crop'!$E$9*$A207","v":{"v":0,"d":"0.00"}},{"$f":"IF($B207=0, \"N/A\", ('Dry Other Crop'!$F$44-'Dry Other Crop'!$F$10+($B207-$B$208)*'Dry Other Crop'!$D$26)/$B207)","v":"N/A"},{"$f":"IF($B207=0, \"N/A\",('Dry Other Crop'!$G$44-'Dry Other Crop'!$G$10+($C207-$C$208)*'Dry Other Crop'!$D$26)/$C207)","v":"N/A"},{"$f":"IF($B207=0, \"N/A\",('Dry Other Crop'!$F$58-'Dry Other Crop'!$F$10+($B207-$B$208)*'Dry Other Crop'!$D$26)/$B207)","v":"N/A"},{"$f":"IF($B207=0, \"N/A\",('Dry Other Crop'!$G$58-'Dry Other Crop'!$G$10+($C207-$C$208)*'Dry Other Crop'!$D$26)/$C207)","v":"N/A"},{"$f":"IF($D207=0, \"N/A\", ('Dry Other Crop'!$H$58-'Dry Other Crop'!$H$10+($D207-$D$208)*'Dry Other Crop'!$D$26)/$D207)","v":"N/A"}]
[{"v":1,"d":"100%"},{"$f":"'Dry Other Crop'!$B$9*$A208","v":{"v":0,"d":"0.00"}},{"$f":"'Dry Other Crop'!$B$9*(1-'Dry Other Crop'!$E$9)*$A208","v":{"v":0,"d":"0.00"}},{"$f":"'Dry Other Crop'!$B$9*'Dry Other Crop'!$E$9*$A208","v":{"v":0,"d":"0.00"}},{"$f":"IF($B208=0, \"N/A\", ('Dry Other Crop'!$F$44-'Dry Other Crop'!$F$10+($B208-$B$208)*'Dry Other Crop'!$D$26)/$B208)","v":"N/A"},{"$f":"IF($B208=0, \"N/A\",('Dry Other Crop'!$G$44-'Dry Other Crop'!$G$10+($C208-$C$208)*'Dry Other Crop'!$D$26)/$C208)","v":"N/A"},{"$f":"IF($B208=0, \"N/A\",('Dry Other Crop'!$F$58-'Dry Other Crop'!$F$10+($B208-$B$208)*'Dry Other Crop'!$D$26)/$B208)","v":"N/A"},{"$f":"IF($B208=0, \"N/A\",('Dry Other Crop'!$G$58-'Dry Other Crop'!$G$10+($C208-$C$208)*'Dry Other Crop'!$D$26)/$C208)","v":"N/A"},{"$f":"IF($D208=0, \"N/A\", ('Dry Other Crop'!$H$58-'Dry Other Crop'!$H$10+($D208-$D$208)*'Dry Other Crop'!$D$26)/$D208)","v":"N/A"}]
[{"v":1.1,"d":"110%"},{"$f":"'Dry Other Crop'!$B$9*$A209","v":{"v":0,"d":"0.00"}},{"$f":"'Dry Other Crop'!$B$9*(1-'Dry Other Crop'!$E$9)*$A209","v":{"v":0,"d":"0.00"}},{"$f":"'Dry Other Crop'!$B$9*'Dry Other Crop'!$E$9*$A209","v":{"v":0,"d":"0.00"}},{"$f":"IF($B209=0, \"N/A\", ('Dry Other Crop'!$F$44-'Dry Other Crop'!$F$10+($B209-$B$208)*'Dry Other Crop'!$D$26)/$B209)","v":"N/A"},{"$f":"IF($B209=0, \"N/A\",('Dry Other Crop'!$G$44-'Dry Other Crop'!$G$10+($C209-$C$208)*'Dry Other Crop'!$D$26)/$C209)","v":"N/A"},{"$f":"IF($B209=0, \"N/A\",('Dry Other Crop'!$F$58-'Dry Other Crop'!$F$10+($B209-$B$208)*'Dry Other Crop'!$D$26)/$B209)","v":"N/A"},{"$f":"IF($B209=0, \"N/A\",('Dry Other Crop'!$G$58-'Dry Other Crop'!$G$10+($C209-$C$208)*'Dry Other Crop'!$D$26)/$C209)","v":"N/A"},{"$f":"IF($D209=0, \"N/A\", ('Dry Other Crop'!$H$58-'Dry Other Crop'!$H$10+($D209-$D$208)*'Dry Other Crop'!$D$26)/$D209)","v":"N/A"}]
[{"v":1.25,"d":"125%"},{"$f":"'Dry Other Crop'!$B$9*$A210","v":{"v":0,"d":"0.00"}},{"$f":"'Dry Other Crop'!$B$9*(1-'Dry Other Crop'!$E$9)*$A210","v":{"v":0,"d":"0.00"}},{"$f":"'Dry Other Crop'!$B$9*'Dry Other Crop'!$E$9*$A210","v":{"v":0,"d":"0.00"}},{"$f":"IF($B210=0, \"N/A\", ('Dry Other Crop'!$F$44-'Dry Other Crop'!$F$10+($B210-$B$208)*'Dry Other Crop'!$D$26)/$B210)","v":"N/A"},{"$f":"IF($B210=0, \"N/A\",('Dry Other Crop'!$G$44-'Dry Other Crop'!$G$10+($C210-$C$208)*'Dry Other Crop'!$D$26)/$C210)","v":"N/A"},{"$f":"IF($B210=0, \"N/A\",('Dry Other Crop'!$F$58-'Dry Other Crop'!$F$10+($B210-$B$208)*'Dry Other Crop'!$D$26)/$B210)","v":"N/A"},{"$f":"IF($B210=0, \"N/A\",('Dry Other Crop'!$G$58-'Dry Other Crop'!$G$10+($C210-$C$208)*'Dry Other Crop'!$D$26)/$C210)","v":"N/A"},{"$f":"IF($D210=0, \"N/A\", ('Dry Other Crop'!$H$58-'Dry Other Crop'!$H$10+($D210-$D$208)*'Dry Other Crop'!$D$26)/$D210)","v":"N/A"}]

{"sheet":"Comparative Returns","index":27,"n_rows":29,"n_cols":25,"rows_kept":29,"merged":[[4,1,4,3],[4,4,4,6],[4,7,4,9],[4,10,4,12],[4,14,4,16],[4,17,4,19],[4,22,4,24]]}
[]
["Comparative Returns"]
["Projected for 2016"]
[]
[null,"Total Revenue",null,null,"Total Variable Costs",null,null,"Return Over Variable Costs",null,null,"Total Costs",{"$nulls":3},"Return Over Variable Costs\nper Acre-Inch Applied",null,null,"Return Over Total Costs",{"$nulls":4},"Break-Even Yield to Cover \nTotal Costs"]
[null,"Total","Tenant","Landlord","Total","Tenant","Landlord","Total","Tenant","Landlord","Total","Tenant","Landlord","ac-in","Total","Tenant","Landlord","Total","Tenant","Landlord","Price","unit","Total","Tenant","Landlord"]
[{"$f":"'Irr Alfalfa'!$A$3:$H$3","v":"Irrigated Alfalfa "},{"$f":"'Irr Alfalfa'!F$12","v":{"v":770,"d":"$770.00"}},{"$f":"'Irr Alfalfa'!G$12","v":{"v":515.9,"d":"$515.90"}},{"$f":"'Irr Alfalfa'!H$12","v":{"v":254.10000000000002,"d":"$254.10"}},{"$f":"'Irr Alfalfa'!F$48","v":{"v":498.91535921126456,"d":"$498.92"}},{"$f":"'Irr Alfalfa'!G$48","v":{"v":450.1630414384599,"d":"$450.16"}},{"$f":"'Irr Alfalfa'!H$48","v":{"v":51.378756,"d":"$51.38"}},{"$f":"B7-E7","v":{"v":271.08464078873544,"d":"$271.08"}},{"$f":"C7-F7","v":{"v":65.73695856154006,"d":"$65.74"}},{"$f":"D7-G7","v":{"v":202.721244,"d":"$202.72"}},{"$f":"'Irr Alfalfa'!F$63","v":{"v":774.2153592112645,"d":"$774.22"}},{"$f":"'Irr Alfalfa'!G$63","v":{"v":605.4630414384599,"d":"$605.46"}},{"$f":"'Irr Alfalfa'!H$63","v":{"v":171.378756,"d":"$171.38"}},{"$f":"'Irr Alfalfa'!B37","v":24},{"$f":"IF($N7=0,\"-\",H7/$N7)","v":{"v":11.29519336619731,"d":"$11.30"}},{"$f":"IF($N7=0,\"-\",I7/$N7)","v":{"v":2.739039940064169,"d":"$2.74"}},{"$f":"IF($N7=0,\"-\",J7/$N7)","v":{"v":8.446718500000001,"d":"$8.45"}},{"$f":"B7-K7","v":{"v":-4.215359211264513,"d":"($4.22)"}},{"$f":"C7-L7","v":{"v":-89.56304143845989,"d":"($89.56)"}},{"$f":"D7-M7","v":{"v":82.72124400000001,"d":"$82.72"}},{"$f":"'Irr Alfalfa'!$D$9","v":{"v":140,"d":"$140.00"}},{"$f":"'Irr Alfalfa'!$C$9","v":"ton"},{"$f":"IF($U7=0, 0, K7/$U7)","v":{"v":5.5301097086518896,"d":"5.5"}},{"$f":"IF($U7=0, 0, IF('Irr Alfalfa'!$E$9=0,0,L7/$U7/(1-'Irr Alfalfa'!$E$9)))","v":{"v":6.4548298660816625,"d":"6.5"}},{"$f":"IF($U7=0, 0, IF('Irr Alfalfa'!$E$9=0,0,M7/$U7/('Irr Alfalfa'!$E$9)))","v":{"v":3.7094968831168833,"d":"3.7"}}]
[{"$f":"'Irr Canola'!$A$3:$H$3","v":"Irrigated Canola"},{"$f":"'Irr Canola'!F$12","v":{"v":305.8,"d":"$305.80"}},{"$f":"'Irr Canola'!G$12","v":{"v":204.886,"d":"$204.89"}},{"$f":"'Irr Canola'!H$12","v":{"v":100.914,"d":"$100.91"}},{"$f":"'Irr Canola'!F$49","v":{"v":284.27470503379925,"d":"$284.27"}},{"$f":"'Irr Canola'!G$49","v":{"v":245.54522746916655,"d":"$245.55"}},{"$f":"'Irr Canola'!H$49","v":{"v":38.20275484646739,"d":"$38.20"}},{"v":21.52529496620076,"d":"$21.53"},{"v":-40.65922746916655,"d":"($40.66)"},{"v":62.71124515353261,"d":"$62.71"},{"$f":"'Irr Canola'!F$63","v":{"v":444.0647050337992,"d":"$444.06"}},{"$f":"'Irr Canola'!G$63","v":{"v":333.3352274691665,"d":"$333.34"}},{"$f":"'Irr Canola'!H$63","v":{"v":110.2027548464674,"d":"$110.20"}},{"$f":"'Irr Canola'!B38","v":10},{"v":2.152529496620076,"d":"$2.15"},{"v":-4.065922746916655,"d":"$4.07"},{"v":6.271124515353261,"d":"$6.27"},{"v":-138.2647050337992,"d":"($138.26)"},{"v":-128.44922746916652,"d":"($128.45)"},{"v":-9.288754846467398,"d":"($9.29)"},{"$f":"'Irr Canola'!$D$9","v":{"v":13.9,"d":"$13.90"}},{"$f":"'Irr Canola'!$C$9","v":"cwt"},{"$f":"IF($U8=0, 0, K8/$U8)","v":{"v":31.947101081568288,"d":"31.9"}},{"$f":"IF($U8=0, 0, IF('Irr Canola'!$E$9=0,0,L8/$U8/(1-'Irr Canola'!$E$9)))","v":{"v":35.79246509923403,"d":"35.8"}},{"$f":"IF($U8=0, 0, IF('Irr Canola'!$E$9=0,0,M8/$U8/('Irr Canola'!$E$9)))","v":{"v":24.025017407121734,"d":"24.0"}}]
[{"$f":"'Irr Corn'!$A$3:$H$3","v":"Irrigated Corn"},{"$f":"'Irr Corn'!F$12","v":{"v":855,"d":"$855.00"}},{"$f":"'Irr Corn'!G$12","v":{"v":572.8499999999999,"d":"$572.85"}},{"$f":"'Irr Corn'!H$12","v":{"v":120,"d":"$120.00"}},{"$f":"'Irr Corn'!F$47","v":{"v":639.5082430185507,"d":"$639.51"}},{"$f":"'Irr Corn'!G$47","v":{"v":555.8152021781673,"d":"$555.82"}},{"$f":"'Irr Corn'!H$47","v":{"v":88.385080265625,"d":"$88.39"}},{"v":215.49175698144927,"d":"$215.49"},{"v":17.034797821832626,"d":"$17.03"},{"v":31.614919734374993,"d":"$31.61"},{"$f":"'Irr Corn'!F$61","v":{"v":868.5082430185507,"d":"$868.51"}},{"$f":"'Irr Corn'!G$61","v":{"v":784.8152021781673,"d":"$784.82"}},{"$f":"'Irr Corn'!H$61","v":{"v":88.385080265625,"d":"$88.39"}},{"$f":"'Irr Corn'!B36","v":22},{"v":9.795079862793148,"d":"$9.80"},{"v":0.7743089919014831,"d":"$0.77"},{"v":1.4370418061079542,"d":"$1.44"},{"v":-13.50824301855073,"d":"($13.51)"},{"v":-211.96520217816737,"d":"($211.97)"},{"v":31.614919734374993,"d":"$31.61"},{"$f":"'Irr Corn'!$D$9","v":{"v":3.8,"d":"$3.80"}},{"$f":"'Irr Corn'!$C$9","v":"bu"},{"v":228.55480079435546,"d":"228.6"},{"$f":"IF($U9=0, 0, IF('Irr Corn'!$E$9=0,0,L9/$U9/(1-'Irr Corn'!$E$9)))","v":{"v":308.25420352638156,"d":"308.3"}},{"$f":"IF($U9=0, 0, IF('Irr Corn'!$E$9=0,0,M9/$U9/('Irr Corn'!$E$9)))","v":{"v":70.48252014802632,"d":"70.5"}}]
[{"$f":"'Irr Corn Silage'!$A$3:$H$3","v":"Irrigated Corn Silage"},{"$f":"'Irr Corn Silage'!F$12","v":{"v":947.7,"d":"$947.70"}},{"$f":"'Irr Corn Silage'!G$12","v":{"v":634.959,"d":"$634.96"}},{"$f":"'Irr Corn Silage'!H$12","v":{"v":312.74100000000004,"d":"$312.74"}},{"$f":"'Irr Corn Silage'!F$47","v":{"v":805.274402466071,"d":"$805.27"}},{"$f":"'Irr Corn Silage'!G$47","v":{"v":722.6980408371794,"d":"$722.70"}},{"$f":"'Irr Corn Silage'!H$47","v":{"v":87.53780526562501,"d":"$87.54"}},{"v":142.42559753392902,"d":"$142.43"},{"v":-87.73904083717946,"d":"($87.74)"},{"v":225.20319473437502,"d":"$225.20"},{"$f":"'Irr Corn Silage'!F$61","v":{"v":1038.584402466071,"d":"$1,038.58"}},{"$f":"'Irr Corn Silage'!G$61","v":{"v":836.0080408371794,"d":"$836.01"}},{"$f":"'Irr Corn Silage'!H$61","v":{"v":207.53780526562502,"d":"$207.54"}},{"$f":"'Irr Corn Silage'!B36","v":20},{"v":7.121279876696451,"d":"$7.12"},{"v":-4.386952041858973,"d":"$4.39"},{"v":11.260159736718752,"d":"$11.26"},{"v":-90.88440246607092,"d":"($90.88)"},{"v":-201.0490408371794,"d":"($201.05)"},{"v":105.20319473437502,"d":"$105.20"},{"$f":"'Irr Corn Silage'!$D$9","v":{"v":35.1,"d":"$35.10"}},{"$f":"'Irr Corn Silage'!$C$9","v":"ton"},{"v":29.589299215557578,"d":"29.6"},{"$f":"IF($U10=0, 0, IF('Irr Corn Silage'!$E$9=0,0,L10/$U10/(1-'Irr Corn Silage'!$E$9)))","v":{"v":35.5490938826032,"d":"35.5"}},{"$f":"IF($U10=0, 0, IF('Irr Corn Silage'!$E$9=0,0,M10/$U10/('Irr Corn Silage'!$E$9)))","v":{"v":17.917448438714064,"d":"17.9"}}]
[{"$f":"'Irr Cotton'!$A$3:$H$3","v":"Irrigated Cotton"},{"$f":"'Irr Cotton'!F$13","v":{"v":1000,"d":"$1,000.00"}},{"$f":"'Irr Cotton'!G$13","v":{"v":669.9999999999999,"d":"$670.00"}},{"$f":"'Irr Cotton'!H$13","v":{"v":330,"d":"$330.00"}},{"$f":"'Irr Cotton'!F$52","v":{"v":647.0453103446303,"d":"$647.05"}},{"$f":"'Irr Cotton'!G$52","v":{"v":528.0559832677721,"d":"$528.06"}},{"$f":"'Irr Cotton'!H$52","v":{"v":118.13391661914639,"d":"$118.13"}},{"v":352.95468965536975,"d":"$352.95"},{"v":141.94401673222774,"d":"$141.94"},{"v":211.8660833808536,"d":"$211.87"},{"$f":"'Irr Cotton'!F$66","v":{"v":799.3353103446302,"d":"$799.34"}},{"$f":"'Irr Cotton'!G$66","v":{"v":608.3459832677721,"d":"$608.35"}},{"$f":"'Irr Cotton'!H$66","v":{"v":190.1339166191464,"d":"$190.13"}},{"$f":"'Irr Cotton'!B41","v":12},{"v":29.412890804614147,"d":"$29.41"},{"v":11.828668061018979,"d":"$11.83"},{"v":17.65550694840447,"d":"$17.66"},{"v":200.66468965536978,"d":"$200.66"},{"v":61.654016732227774,"d":"$61.65"},{"v":139.8660833808536,"d":"$139.87"},{"$f":"'Irr Cotton'!$D$9","v":{"v":0.65,"d":"$0.65"}},{"$f":"'Irr Cotton'!$C$9","v":"lb"},{"$f":"IF($U11=0, 0, K11/($U11+Cottonseed_Price/2000*'Universal Input Prices'!$B$39/500))","v":{"v":999.1691379307878,"d":"999.2"}},{"$f":"IF($U11=0, 0, IF('Irr Cotton'!$E$9=0,0,L11/($U11+Cottonseed_Price/2000*'Universal Input Prices'!$B$39/500)/(1-'Irr Cotton'!$E$9)))","v":{"v":1134.973849380172,"d":"1,135.0"}},{"$f":"IF($U11=0, 0, IF('Irr Cotton'!$E$9=0,0,M11/($U11+Cottonseed_Price/2000*'Universal Input Prices'!$B$39/500)/('Irr Cotton'!$E$9)))","v":{"v":720.2042296179787,"d":"720.2"}}]
[{"$f":"'Irr Peanuts'!$A$3:$H$3","v":"Irrigated Peanuts"},{"$f":"'Irr Peanuts'!F$12","v":{"v":945,"d":"$945.00"}},{"$f":"'Irr Peanuts'!G$12","v":{"v":633.15,"d":"$633.15"}},{"$f":"'Irr Peanuts'!H$12","v":{"v":311.85,"d":"$311.85"}},{"$f":"'Irr Peanuts'!F$51","v":{"v":741.5721879585827,"d":"$741.57"}},{"$f":"'Irr Peanuts'!G$51","v":{"v":653.9504602378044,"d":"$653.95"}},{"$f":"'Irr Peanuts'!H$51","v":{"v":90.63635165869566,"d":"$90.64"}},{"v":203.42781204141727,"d":"$203.43"},{"v":-20.800460237804373,"d":"($20.80)"},{"v":221.21364834130435,"d":"$221.21"},{"$f":"'Irr Peanuts'!F$65","v":{"v":949.7321879585827,"d":"$949.73"}},{"$f":"'Irr Peanuts'!G$65","v":{"v":790.1104602378043,"d":"$790.11"}},{"$f":"'Irr Peanuts'!H$65","v":{"v":162.63635165869567,"d":"$162.64"}},{"$f":"'Irr Peanuts'!B40","v":21},{"v":9.687038668638918,"d":"$9.69"},{"v":-0.990498106562113,"d":"$0.99"},{"v":10.533983254347826,"d":"$10.53"},{"v":-4.732187958582699,"d":"($4.73)"},{"v":-156.96046023780434,"d":"($156.96)"},{"v":149.21364834130435,"d":"$149.21"},{"$f":"'Irr Peanuts'!$D$9","v":{"v":420,"d":"$420.00"}},{"$f":"'Irr Peanuts'!$C$9","v":"ton"},{"v":2.2612671141871017,"d":"2.3"},{"$f":"IF($U12=0, 0, IF('Irr Peanuts'!$E$9=0,0,L12/$U12/(1-'Irr Peanuts'!$E$9)))","v":{"v":2.8077841515202713,"d":"2.8"}},{"$f":"IF($U12=0, 0, IF('Irr Peanuts'!$E$9=0,0,M12/$U12/('Irr Peanuts'!$E$9)))","v":{"v":1.1734224506399398,"d":"1.2"}}]
[{"$f":"'Irr Sorghum'!$A$3:$H$3","v":"Irrigated Sorghum"},{"$f":"'Irr Sorghum'!F$12","v":{"v":345,"d":"$345.00"}},{"$f":"'Irr Sorghum'!G$12","v":{"v":231.14999999999998,"d":"$231.15"}},{"$f":"'Irr Sorghum'!H$12","v":{"v":113.85000000000001,"d":"$113.85"}},{"$f":"'Irr Sorghum'!F$46","v":{"v":337.83101785584927,"d":"$337.83"}},{"$f":"'Irr Sorghum'!G$46","v":{"v":275.89486968429907,"d":"$275.89"}},{"$f":"'Irr Sorghum'!H$46","v":{"v":63.452287067812506,"d":"$63.45"}},{"v":7.168982144150732,"d":"$7.17"},{"v":-44.74486968429909,"d":"($44.74)"},{"v":50.3977129321875,"d":"$50.40"},{"$f":"'Irr Sorghum'!F$60","v":{"v":517.5010178558493,"d":"$517.50"}},{"$f":"'Irr Sorghum'!G$60","v":{"v":383.5648696842991,"d":"$383.56"}},{"$f":"'Irr Sorghum'!H$60","v":{"v":135.4522870678125,"d":"$135.45"}},{"$f":"'Irr Sorghum'!B35","v":10},{"v":0.7168982144150732,"d":"$0.72"},{"v":-4.474486968429909,"d":"$4.47"},{"v":5.039771293218751,"d":"$5.04"},{"v":-172.50101785584934,"d":"($172.50)"},{"v":-152.4148696842991,"d":"($152.41)"},{"v":-21.602287067812497,"d":"($21.60)"},{"$f":"'Irr Sorghum'!$D$9","v":{"v":5.75,"d":"$5.75"}},{"$f":"'Irr Sorghum'!$C$9","v":"cwt"},{"$f":"IF($U13=0, 0, (K13-'Irr Sorghum'!F$10)/$U13)","v":{"v":90.00017701840858,"d":"90.0"}},{"$f":"IF($U13=0, 0, IF('Irr Sorghum'!$E$9=0,0,(L13-'Irr Sorghum'!F$10)/$U13/(1-'Irr Sorghum'!$E$9)))","v":{"v":99.56258784796862,"d":"99.6"}},{"$f":"IF($U13=0, 0, IF('Irr Sorghum'!$E$9=0,0,(M13-'Irr Sorghum'!F$10)/$U13/('Irr Sorghum'!$E$9)))","v":{"v":71.3846045153162,"d":"71.4"}}]
[{"$f":"'Irr Sorghum Seed'!$A$3:$H$3","v":"Irrigated Sorghum Seed "},{"$f":"'Irr Sorghum Seed'!F$12","v":{"v":760.4999999999999,"d":"$760.50"}},{"$f":"'Irr Sorghum Seed'!G$12","v":{"v":509.53499999999985,"d":"$509.54"}},{"$f":"'Irr Sorghum Seed'!H$12","v":{"v":250.96499999999997,"d":"$250.97"}},{"$f":"'Irr Sorghum Seed'!F$46","v":{"v":377.2162627476923,"d":"$377.22"}},{"$f":"'Irr Sorghum Seed'!G$46","v":{"v":304.69278723074996,"d":"$304.69"}},{"$f":"'Irr Sorghum Seed'!H$46","v":{"v":74.59252354125002,"d":"$74.59"}},{"v":383.28373725230756,"d":"$383.28"},{"v":204.8422127692499,"d":"$204.84"},{"v":176.37247645874996,"d":"$176.37"},{"$f":"'Irr Sorghum Seed'!F$60","v":{"v":547.1062627476923,"d":"$547.11"}},{"$f":"'Irr Sorghum Seed'!G$60","v":{"v":402.58278723074994,"d":"$402.58"}},{"$f":"'Irr Sorghum Seed'!H$60","v":{"v":146.59252354125002,"d":"$146.59"}},{"$f":"'Irr Sorghum Seed'!B35","v":16},{"v":23.955233578269223,"d":"$23.96"},{"v":12.802638298078119,"d":"$12.80"},{"v":11.023279778671872,"d":"$11.02"},{"v":213.39373725230757,"d":"$213.39"},{"v":106.95221276924991,"d":"$106.95"},{"v":104.37247645874996,"d":"$104.37"},{"$f":"'Irr Sorghum Seed'!$D$9","v":{"v":16.9,"d":"$16.90"}},{"$f":"'Irr Sorghum Seed'!$C$9","v":"cwt"},{"$f":"IF($U14=0, 0, (K14-'Irr Sorghum Seed'!F$10)/$U14)","v":{"v":32.37315164187529,"d":"32.4"}},{"$f":"IF($U14=0, 0, IF('Irr Sorghum Seed'!$E$9=0,0,(L14-'Irr Sorghum Seed'!F$10)/$U14/(1-'Irr Sorghum Seed'!$E$9)))","v":{"v":35.554427910514,"d":"35.6"}},{"$f":"IF($U14=0, 0, IF('Irr Sorghum Seed'!$E$9=0,0,(M14-'Irr Sorghum Seed'!F$10)/$U14/('Irr Sorghum Seed'!$E$9)))","v":{"v":26.28519339093599,"d":"26.3"}}]
[{"$f":"'Irr Sorghum Silage'!$A$3:$H$3","v":"Irrigated Sorghum Silage"},{"$f":"'Irr Sorghum Silage'!F$12","v":{"v":663.6,"d":"$663.60"}},{"$f":"'Irr Sorghum Silage'!G$12","v":{"v":444.61199999999997,"d":"$444.61"}},{"$f":"'Irr Sorghum Silage'!H$12","v":{"v":218.98800000000003,"d":"$218.99"}},{"$f":"'Irr Sorghum Silage'!F$46","v":{"v":507.50204161376456,"d":"$507.50"}},{"$f":"'Irr Sorghum Silage'!G$46","v":{"v":441.3186140533043,"d":"$441.32"}},{"$f":"'Irr Sorghum Silage'!H$46","v":{"v":67.58514803700001,"d":"$67.59"}},{"v":156.09795838623546,"d":"$156.10"},{"v":3.2933859466956505,"d":"$3.29"},{"v":151.40285196300002,"d":"$151.40"},{"$f":"'Irr Sorghum Silage'!F$60","v":{"v":674.1020416137645,"d":"$674.10"}},{"$f":"'Irr Sorghum Silage'!G$60","v":{"v":535.9186140533043,"d":"$535.92"}},{"$f":"'Irr Sorghum Silage'!H$60","v":{"v":139.585148037,"d":"$139.59"}},{"$f":"'Irr Sorghum Silage'!B35","v":13},{"v":12.007535260479651,"d":"$12.01"},{"v":0.25333738051505006,"d":"$0.25"},{"v":11.646373227923078,"d":"$11.65"},{"v":-10.502041613764504,"d":"($10.50)"},{"v":-91.30661405330432,"d":"($91.31)"},{"v":79.40285196300002,"d":"$79.40"},{"$f":"'Irr Sorghum Silage'!$D$9","v":{"v":31.6,"d":"$31.60"}},{"$f":"'Irr Sorghum Silage'!$C$9","v":"ton"},{"v":21.33234308904318,"d":"21.3"},{"$f":"IF($U15=0, 0, IF('Irr Sorghum Silage'!$E$9=0,0,L15/$U15/(1-'Irr Sorghum Silage'!$E$9)))","v":{"v":25.312611659423023,"d":"25.3"}},{"$f":"IF($U15=0, 0, IF('Irr Sorghum Silage'!$E$9=0,0,M15/$U15/('Irr Sorghum Silage'!$E$9)))","v":{"v":13.385610667146144,"d":"13.4"}}]
[{"$f":"'Irr Sorghum Sudangrass'!$A$3:$H$3","v":"Irrigated Sorghum Sudangrass"},{"$f":"'Irr Sorghum Sudangrass'!F$12","v":{"v":320,"d":"$320.00"}},{"$f":"'Irr Sorghum Sudangrass'!G$12","v":{"v":214.39999999999998,"d":"$214.40"}},{"$f":"'Irr Sorghum Sudangrass'!H$12","v":{"v":105.60000000000001,"d":"$105.60"}},{"$f":"'Irr Sorghum Sudangrass'!F$46","v":{"v":254.17800383437893,"d":"$254.18"}},{"$f":"'Irr Sorghum Sudangrass'!G$46","v":{"v":205.69779608845997,"d":"$205.70"}},{"$f":"'Irr Sorghum Sudangrass'!H$46","v":{"v":50.158680000000004,"d":"$50.16"}},{"v":65.82199616562107,"d":"$65.82"},{"v":8.70220391154001,"d":"$8.70"},{"v":55.441320000000005,"d":"$55.44"},{"$f":"'Irr Sorghum Sudangrass'!F$60","v":{"v":410.19800383437894,"d":"$410.20"}},{"$f":"'Irr Sorghum Sudangrass'!G$60","v":{"v":289.71779608846,"d":"$289.72"}},{"$f":"'Irr Sorghum Sudangrass'!H$60","v":{"v":122.15868,"d":"$122.16"}},{"$f":"'Irr Sorghum Sudangrass'!B35","v":9},{"v":7.313555129513452,"d":"$7.31"},{"v":0.9669115457266678,"d":"$0.97"},{"v":6.160146666666667,"d":"$6.16"},{"v":-90.19800383437894,"d":"($90.20)"},{"v":-75.31779608846,"d":"($75.32)"},{"v":-16.558679999999995,"d":"($16.56)"},{"$f":"'Irr Sorghum Sudangrass'!$D$9","v":{"v":0.4,"d":"$0.40"}},{"$f":"'Irr Sorghum Sudangrass'!$C$9","v":"lb"},{"v":1025.4950095859472,"d":"1,025.5"},{"$f":"IF($U16=0, 0, IF('Irr Sorghum Sudangrass'!$E$9=0,0,L16/$U16/(1-'Irr Sorghum Sudangrass'!$E$9)))","v":{"v":1081.0365525688806,"d":"1,081.0"}},{"$f":"IF($U16=0, 0, IF('Irr Sorghum Sudangrass'!$E$9=0,0,M16/$U16/('Irr Sorghum Sudangrass'!$E$9)))","v":{"v":925.4445454545454,"d":"925.4"}}]
[{"$f":"'Irr Soybeans'!$A$3:$H$3","v":"Irrigated Soybeans"},{"$f":"'Irr Soybeans'!F$12","v":{"v":504,"d":"$504.00"}},{"$f":"'Irr Soybeans'!G$12","v":{"v":337.67999999999995,"d":"$337.68"}},{"$f":"'Irr Soybeans'!H$12","v":{"v":166.32000000000002,"d":"$166.32"}},{"$f":"'Irr Soybeans'!F$49","v":{"v":367.27839048,"d":"$367.28"}},{"$f":"'Irr Soybeans'!G$49","v":{"v":323.045657248,"d":"$323.05"}},{"$f":"'Irr Soybeans'!H$49","v":{"v":46.4815065,"d":"$46.48"}},{"v":136.72160952000002,"d":"$136.72"},{"v":14.634342751999952,"d":"$14.63"},{"v":119.83849350000003,"d":"$119.84"},{"$f":"'Irr Soybeans'!F$63","v":{"v":538.29839048,"d":"$538.30"}},{"$f":"'Irr Soybeans'!G$63","v":{"v":422.065657248,"d":"$422.07"}},{"$f":"'Irr Soybeans'!H$63","v":{"v":118.4815065,"d":"$118.48"}},{"$f":"'Irr Soybeans'!B38","v":14},{"v":9.765829251428572,"d":"$9.77"},{"v":1.045310196571425,"d":"$1.05"},{"v":8.559892392857146,"d":"$8.56"},{"v":-34.298390479999966,"d":"($34.30)"},{"v":-84.38565724800003,"d":"($84.39)"},{"v":47.83849350000003,"d":"$47.84"},{"$f":"'Irr Soybeans'!$D$9","v":{"v":8.4,"d":"$8.40"}},{"$f":"'Irr Soybeans'!$C$9","v":"bu"},{"v":64.08314172380952,"d":"64.1"},{"$f":"IF($U17=0, 0, IF('Irr Soybeans'!$E$9=0,0,L17/$U17/(1-'Irr Soybeans'!$E$9)))","v":{"v":74.99389787633262,"d":"75.0"}},{"$f":"IF($U17=0, 0, IF('Irr Soybeans'!$E$9=0,0,M17/$U17/('Irr Soybeans'!$E$9)))","v":{"v":42.74224621212121,"d":"42.7"}}]
[{"$f":"'Irr Sunflowers-Confection'!$A$3:$H$3","v":"Irrigated Sunflowers-Confectionary "},{"$f":"'Irr Sunflowers-Confection'!F$13","v":{"v":378,"d":"$378.00"}},{"$f":"'Irr Sunflowers-Confection'!G$13","v":{"v":253.25999999999996,"d":"$253.26"}},{"$f":"'Irr Sunflowers-Confection'!H$13","v":{"v":124.74000000000001,"d":"$124.74"}},{"$f":"'Irr Sunflowers-Confection'!F$49","v":{"v":284.8731081499999,"d":"$284.87"}},{"$f":"'Irr Sunflowers-Confection'!G$49","v":{"v":236.795424554375,"d":"$236.80"}},{"$f":"'Irr Sunflowers-Confection'!H$49","v":{"v":48.39327662812501,"d":"$48.39"}},{"v":93.1268918500001,"d":"$93.13"},{"v":16.464575445624973,"d":"$16.46"},{"v":76.346723371875,"d":"$76.35"},{"$f":"'Irr Sunflowers-Confection'!F$63","v":{"v":437.3031081499999,"d":"$437.30"}},{"$f":"'Irr Sunflowers-Confection'!G$63","v":{"v":317.22542455437497,"d":"$317.23"}},{"$f":"'Irr Sunflowers-Confection'!H$63","v":{"v":120.39327662812501,"d":"$120.39"}},{"$f":"'Irr Sunflowers-Confection'!B38","v":7},{"v":13.303841692857159,"d":"$13.30"},{"v":2.3520822065178533,"d":"$2.35"},{"v":10.906674767410715,"d":"$10.91"},{"v":-59.3031081499999,"d":"($59.30)"},{"v":-63.965424554375005,"d":"($63.97)"},{"v":4.346723371875001,"d":"$4.35"},{"$f":"'Irr Sunflowers-Confection'!$D$9","v":{"v":21,"d":"$21.00"}},{"$f":"'Irr Sunflowers-Confection'!$C$9","v":"cwt"},{"v":20.823957530952377,"d":"20.8"},{"$f":"IF($U18=0, 0, IF('Irr Sunflowers-Confection'!$E$9=0,0,L18/$U18/(1-'Irr Sunflowers-Confection'!$E$9)))","v":{"v":22.546227757951314,"d":"22.5"}},{"$f":"IF($U18=0, 0, IF('Irr Sunflowers-Confection'!$E$9=0,0,M18/$U18/('Irr Sunflowers-Confection'!$E$9)))","v":{"v":17.37276719020563,"d":"17.4"}}]
[{"$f":"'Irr Sunflowers-Oilseed'!$A$3:$H$3","v":"Irrigated Sunflowers-Oilseed "},{"$f":"'Irr Sunflowers-Oilseed'!F$12","v":{"v":330,"d":"$330.00"}},{"$f":"'Irr Sunflowers-Oilseed'!G$12","v":{"v":221.09999999999997,"d":"$221.10"}},{"$f":"'Irr Sunflowers-Oilseed'!H$12","v":{"v":108.9,"d":"$108.90"}},{"$f":"'Irr Sunflowers-Oilseed'!F$48","v":{"v":283.8755367214285,"d":"$283.88"}},{"$f":"'Irr Sunflowers-Oilseed'!G$48","v":{"v":224.643256554375,"d":"$224.64"}},{"$f":"'Irr Sunflowers-Oilseed'!H$48","v":{"v":59.545494628125,"d":"$59.55"}},{"v":46.12446327857151,"d":"$46.12"},{"v":-3.5432565543750343,"d":"($3.54)"},{"v":49.35450537187501,"d":"$49.35"},{"$f":"'Irr Sunflowers-Oilseed'!F$62","v":{"v":436.3055367214285,"d":"$436.31"}},{"$f":"'Irr Sunflowers-Oilseed'!G$62","v":{"v":305.073256554375,"d":"$305.07"}},{"$f":"'Irr Sunflowers-Oilseed'!H$62","v":{"v":131.545494628125,"d":"$131.55"}},{"$f":"'Irr Sunflowers-Oilseed'!B37","v":7},{"v":6.58920903979593,"d":"$6.59"},{"v":-0.506179507767862,"d":"$0.51"},{"v":7.050643624553572,"d":"$7.05"},{"v":-106.3055367214285,"d":"($106.31)"},{"v":-83.97325655437504,"d":"($83.97)"},{"v":-22.645494628124993,"d":"($22.65)"},{"$f":"'Irr Sunflowers-Oilseed'!$D$9","v":{"v":16.5,"d":"$16.50"}},{"$f":"'Irr Sunflowers-Oilseed'!$C$9","v":"cwt"},{"v":26.442759801298696,"d":"26.4"},{"$f":"IF($U19=0, 0, IF('Irr Sunflowers-Oilseed'!$E$9=0,0,L19/$U19/(1-'Irr Sunflowers-Oilseed'!$E$9)))","v":{"v":27.59595265078019,"d":"27.6"}},{"$f":"IF($U19=0, 0, IF('Irr Sunflowers-Oilseed'!$E$9=0,0,M19/$U19/('Irr Sunflowers-Oilseed'!$E$9)))","v":{"v":24.158952181473826,"d":"24.2"}}]
[{"$f":"'Irr Triticale Silage'!$A$3:$H$3","v":"Irrigated Triticale Silage"},{"$f":"'Irr Triticale Silage'!F$12","v":{"v":316,"d":"$316.00"}},{"$f":"'Irr Triticale Silage'!G$12","v":{"v":211.71999999999997,"d":"$211.72"}},{"$f":"'Irr Triticale Silage'!H$12","v":{"v":104.28,"d":"$104.28"}},{"$f":"'Irr Triticale Silage'!F$46","v":{"v":313.90743592294115,"d":"$313.91"}},{"$f":"'Irr Triticale Silage'!G$46","v":{"v":281.11756080949993,"d":"$281.12"}},{"$f":"'Irr Triticale Silage'!H$46","v":{"v":31.755867,"d":"$31.76"}},{"$f":"B20-E20","v":{"v":2.092564077058853,"d":"$2.09"}},{"$f":"C20-F20","v":{"v":-69.39756080949996,"d":"($69.40)"}},{"$f":"D20-G20","v":{"v":72.524133,"d":"$72.52"}},{"$f":"'Irr Triticale Silage'!F$60","v":{"v":473.82743592294116,"d":"$473.83"}},{"$f":"'Irr Triticale Silage'!G$60","v":{"v":369.03756080949995,"d":"$369.04"}},{"$f":"'Irr Triticale Silage'!H$60","v":{"v":103.755867,"d":"$103.76"}},{"$f":"'Irr Sorghum Sudangrass'!B36","v":{"v":48.49,"d":"48"}},{"$f":"IF($N20=0,\"-\",H20/$N20)","v":{"v":0.04315454891851625,"d":"$0.04"}},{"$f":"IF($N20=0,\"-\",I20/$N20)","v":{"v":-1.4311726296040412,"d":"$1.43"}},{"$f":"IF($N20=0,\"-\",J20/$N20)","v":{"v":1.4956513301711694,"d":"$1.50"}},{"$f":"B20-K20","v":{"v":-157.82743592294116,"d":"($157.83)"}},{"$f":"C20-L20","v":{"v":-157.31756080949998,"d":"($157.32)"}},{"$f":"D20-M20","v":{"v":0.5241330000000062,"d":"$0.52"}},{"$f":"'Irr Triticale Silage'!$D$9","v":{"v":31.6,"d":"$31.60"}},{"$f":"'Irr Triticale Silage'!$C$9","v":"ton"},{"$f":"IF($U20=0, 0, K20/$U20)","v":{"v":14.99453911148548,"d":"15.0"}},{"$f":"IF($U20=0, 0, IF('Irr Triticale Silage'!$E$9=0,0,L20/$U20/(1-'Irr Triticale Silage'!$E$9)))","v":{"v":17.430453467291706,"d":"17.4"}},{"$f":"IF($U20=0, 0, IF('Irr Triticale Silage'!$E$9=0,0,M20/$U20/('Irr Triticale Silage'!$E$9)))","v":{"v":9.949737917146143,"d":"9.9"}}]
[{"$f":"'Irr Wheat'!$A$3:$H$3","v":"Irrigated Wheat"},{"$f":"'Irr Wheat'!F$13","v":{"v":251.9,"d":"$251.90"}},{"$f":"'Irr Wheat'!G$13","v":{"v":168.773,"d":"$168.77"}},{"$f":"'Irr Wheat'!H$13","v":{"v":83.127,"d":"$83.13"}},{"$f":"'Irr Wheat'!F$47","v":{"v":280.58816233766663,"d":"$280.59"}},{"$f":"'Irr Wheat'!G$47","v":{"v":235.0774030400225,"d":"$235.08"}},{"$f":"'Irr Wheat'!H$47","v":{"v":43.974896367187505,"d":"$43.97"}},{"v":-28.688162337666625,"d":"($28.69)"},{"v":-66.30440304002249,"d":"($66.30)"},{"v":39.15210363281249,"d":"$39.15"},{"$f":"'Irr Wheat'!F$61","v":{"v":440.5081623376666,"d":"$440.51"}},{"$f":"'Irr Wheat'!G$61","v":{"v":322.9974030400225,"d":"$323.00"}},{"$f":"'Irr Wheat'!H$61","v":{"v":115.97489636718751,"d":"$115.97"}},{"$f":"'Irr Wheat'!B36","v":10},{"v":-2.8688162337666627,"d":"$2.87"},{"v":-6.630440304002249,"d":"$6.63"},{"v":3.915210363281249,"d":"$3.92"},{"v":-188.60816233766658,"d":"($188.61)"},{"v":-154.2244030400225,"d":"($154.22)"},{"v":-32.847896367187516,"d":"($32.85)"},{"$f":"'Irr Wheat'!$D$9","v":{"v":3.95,"d":"$3.95"}},{"$f":"'Irr Wheat'!$C$9","v":"bu"},{"$f":"IF($U21=0, 0, (K21-'Irr Wheat'!$F$10)/$U21)","v":{"v":97.74890185763711,"d":"97.7"}},{"$f":"IF($U21=0, 0, IF('Irr Wheat'!$E$9=0,0,(L21-'Irr Wheat'!$G$10)/$U21/(1-'Irr Wheat'!$E$9)))","v":{"v":108.27485472889572,"d":"108.3"}},{"$f":"IF($U21=0, 0, IF('Irr Wheat'!$E$9=0,0,(M21-'Irr Wheat'!$H$10)/$U21/('Irr Wheat'!$E$9)))","v":{"v":75.19976706343499,"d":"75.2"}}]
[{"$f":"'Irr Other Crop'!$A$3:$H$3","v":"Irrigated Other Crop"},{"$f":"'Irr Other Crop'!F$12","v":{"v":0,"d":"$0.00"}},{"$f":"'Irr Other Crop'!G$12","v":{"v":0,"d":"$0.00"}},{"$f":"'Irr Other Crop'!H$12","v":{"v":0,"d":"$0.00"}},{"$f":"'Irr Other Crop'!F$48","v":{"v":0,"d":"$0.00"}},{"$f":"'Irr Other Crop'!G$48","v":{"v":0,"d":"$0.00"}},{"$f":"'Irr Other Crop'!H$48","v":{"v":0,"d":"$0.00"}},{"v":0,"d":"$0.00"},{"v":0,"d":"$0.00"},{"v":0,"d":"$0.00"},{"$f":"'Irr Other Crop'!F$62","v":{"v":0,"d":"$0.00"}},{"$f":"'Irr Other Crop'!G$62","v":{"v":0,"d":"$0.00"}},{"$f":"'Irr Other Crop'!H$62","v":{"v":0,"d":"$0.00"}},{"$f":"'Irr Other Crop'!B37","v":0},{"$f":"IF($N22=0,\"-\",H22/$N22)","v":"-"},"-","-",{"v":0,"d":"$0.00"},{"v":0,"d":"$0.00"},{"v":0,"d":"$0.00"},{"$f":"'Irr Other Crop'!$D$9","v":{"v":0,"d":"$0.00"}},{"$f":"'Irr Other Crop'!$C$9","v":"unit"},{"$f":"IF($U22=0, 0, (K22-'Irr Other Crop'!$F$10)/$U22)","v":0},{"$f":"IF($U22=0, 0, IF('Irr Other Crop'!$E$9=0,0,(L22-'Irr Other Crop'!$G$10)/$U22/(1-'Irr Other Crop'!$E$9)))","v":0},{"$f":"IF($U22=0, 0, IF('Irr Other Crop'!$E$9=0,0,(M22-'Irr Other Crop'!$H$10)/$U22/('Irr Other Crop'!$E$9)))","v":0}]
[{"$f":"'Dry Canola'!$A$3:$H$3","v":"Dryland Canola"},{"$f":"'Dry Canola'!F$12","v":{"v":152.9,"d":"$152.90"}},{"$f":"'Dry Canola'!G$12","v":{"v":102.443,"d":"$102.44"}},{"$f":"'Dry Canola'!H$12","v":{"v":50.457,"d":"$50.46"}},{"$f":"'Dry Canola'!F$45","v":{"v":149.3779113398635,"d":"$149.38"}},{"$f":"'Dry Canola'!G$45","v":{"v":135.33294172832063,"d":"$135.33"}},{"$f":"'Dry Canola'!H$45","v":{"v":13.697121326086958,"d":"$13.70"}},{"v":3.522088660136518,"d":"$3.52"},{"v":-32.889941728320636,"d":"($32.89)"},{"v":36.75987867391304,"d":"$36.76"},{"$f":"'Dry Canola'!F$59","v":{"v":202.56791133986349,"d":"$202.57"}},{"$f":"'Dry Canola'!G$59","v":{"v":162.02294172832063,"d":"$162.02"}},{"$f":"'Dry Canola'!H$59","v":{"v":40.19712132608696,"d":"$40.20"}},{"$f":"'Dry Canola'!#REF!","v":{"$error":"#REF!"}},{"$error":"#REF!"},{"$error":"#REF!"},{"$error":"#REF!"},{"v":-49.66791133986348,"d":"($49.67)"},{"v":-59.579941728320634,"d":"($59.58)"},{"v":10.259878673913043,"d":"$10.26"},{"$f":"'Dry Canola'!$D$9","v":{"v":13.9,"d":"$13.90"}},{"$f":"'Dry Canola'!$C$9","v":"cwt"},{"v":14.573231031644855,"d":"14.6"},{"$f":"IF($U23=0, 0, IF('Dry Canola'!$E$9=0,0,L23/$U23/(1-'Dry Canola'!$E$9)))","v":{"v":17.397502601559182,"d":"17.4"}},{"$f":"IF($U23=0, 0, IF('Dry Canola'!$E$9=0,0,M23/$U23/('Dry Canola'!$E$9)))","v":{"v":8.763270400280566,"d":"8.8"}}]
[{"$f":"'Dry Cotton'!$A$3:$H$3","v":"Dryland Cotton"},{"$f":"'Dry Cotton'!F$13","v":{"v":320,"d":"$320.00"}},{"$f":"'Dry Cotton'!G$13","v":{"v":320,"d":"$320.00"}},{"$f":"'Dry Cotton'!H$13","v":{"v":0,"d":"$0.00"}},{"$f":"'Dry Cotton'!F$49","v":{"v":290.14245206277263,"d":"$290.14"}},{"$f":"'Dry Cotton'!G$49","v":{"v":289.5711777863618,"d":"$289.57"}},{"$f":"'Dry Cotton'!H$49","v":{"v":0,"d":"$0.00"}},{"v":29.857547937227366,"d":"$29.86"},{"v":30.428822213638227,"d":"$30.43"},{"v":0,"d":"$0.00"},{"$f":"'Dry Cotton'!F$63","v":{"v":346.74245206277266,"d":"$346.74"}},{"$f":"'Dry Cotton'!G$63","v":{"v":346.1711777863618,"d":"$346.17"}},{"$f":"'Dry Cotton'!H$63","v":{"v":0,"d":"$0.00"}},{"$f":"'Dry Cotton'!#REF!","v":{"$error":"#REF!"}},{"$error":"#REF!"},{"$error":"#REF!"},{"$error":"#REF!"},{"v":-26.742452062772657,"d":"($26.74)"},{"v":-26.171177786361795,"d":"($26.17)"},{"v":0,"d":"$0.00"},{"$f":"'Dry Cotton'!$D$9","v":{"v":0.65,"d":"$0.65"}},{"$f":"'Dry Cotton'!$C$9","v":"lb"},{"$f":"IF($U24=0, 0, K24/($U24+Cottonseed_Price/2000*'Universal Input Prices'!$B$39/500))","v":{"v":433.4280650784658,"d":"433.4"}},{"$f":"IF($U24=0, 0, IF('Dry Cotton'!$E$9=0,0,L24/($U24+Cottonseed_Price/2000*'Universal Input Prices'!$B$39/500)/(1-'Dry Cotton'!$E$9)))","v":0},{"$f":"IF($U24=0, 0, IF('Dry Cotton'!$E$9=0,0,M24/($U24+Cottonseed_Price/2000*'Universal Input Prices'!$B$39/500)/('Dry Cotton'!$E$9)))","v":0}]
[{"$f":"'Dry Sorghum'!$A$3:$H$3","v":"Dryland Sorghum"},{"$f":"'Dry Sorghum'!F$12","v":{"v":143.75,"d":"$143.75"}},{"$f":"'Dry Sorghum'!G$12","v":{"v":143.75,"d":"$143.75"}},{"$f":"'Dry Sorghum'!H$12","v":{"v":0,"d":"$0.00"}},{"$f":"'Dry Sorghum'!F$43","v":{"v":156.57180184344173,"d":"$156.57"}},{"$f":"'Dry Sorghum'!G$43","v":{"v":150.4031679891384,"d":"$150.40"}},{"$f":"'Dry Sorghum'!H$43","v":{"v":7.11711,"d":"$7.12"}},{"v":-12.821801843441733,"d":"($12.82)"},{"v":-6.65316798913841,"d":"($6.65)"},{"v":-7.11711,"d":"($7.12)"},{"$f":"'Dry Sorghum'!F$57","v":{"v":208.20180184344173,"d":"$208.20"}},{"$f":"'Dry Sorghum'!G$57","v":{"v":202.0331679891384,"d":"$202.03"}},{"$f":"'Dry Sorghum'!H$57","v":{"v":7.11711,"d":"$7.12"}},{"$f":"'Dry Sorghum'!#REF!","v":{"$error":"#REF!"}},{"$error":"#REF!"},{"$error":"#REF!"},{"$error":"#REF!"},{"v":-64.45180184344173,"d":"($64.45)"},{"v":-58.283167989138406,"d":"($58.28)"},{"v":-7.11711,"d":"($7.12)"},{"$f":"'Dry Sorghum'!$D$9","v":{"v":5.75,"d":"$5.75"}},{"$f":"'Dry Sorghum'!$C$9","v":"cwt"},{"$f":"IF($U25=0, 0, (K25-'Dry Sorghum'!F$10)/$U25)","v":{"v":36.20900901625073,"d":"36.2"}},{"$f":"IF($U25=0, 0, IF('Dry Sorghum'!$E$9=0,0,(L25-'Dry Sorghum'!F$10)/$U25/(1-'Dry Sorghum'!$E$9)))","v":0},{"$f":"IF($U25=0, 0, IF('Dry Sorghum'!$E$9=0,0,(M25-'Dry Sorghum'!F$10)/$U25/('Dry Sorghum'!$E$9)))","v":0}]
[{"$f":"'Dry Sorghum Sudangrass'!$A$3:$H$3","v":"Dryland Sorghum Sudangrass"},{"$f":"'Dry Sorghum Sudangrass'!F$12","v":{"v":134.4,"d":"$134.40"}},{"$f":"'Dry Sorghum Sudangrass'!G$12","v":{"v":90.04799999999999,"d":"$90.05"}},{"$f":"'Dry Sorghum Sudangrass'!H$12","v":{"v":44.352000000000004,"d":"$44.35"}},{"$f":"'Dry Sorghum Sudangrass'!F$42","v":{"v":109.89465282950036,"d":"$109.89"}},{"$f":"'Dry Sorghum Sudangrass'!G$42","v":{"v":90.74778539353797,"d":"$90.75"}},{"$f":"'Dry Sorghum Sudangrass'!H$42","v":{"v":19.860126,"d":"$19.86"}},{"v":24.505347170499647,"d":"$24.51"},{"v":-0.6997853935379794,"d":"($0.70)"},{"v":24.491874000000003,"d":"$24.49"},{"$f":"'Dry Sorghum Sudangrass'!F$56","v":{"v":160.32465282950037,"d":"$160.32"}},{"$f":"'Dry Sorghum Sudangrass'!G$56","v":{"v":114.67778539353796,"d":"$114.68"}},{"$f":"'Dry Sorghum Sudangrass'!H$56","v":{"v":46.360126,"d":"$46.36"}},{"$f":"'Dry Sorghum Sudangrass'!#REF!","v":{"$error":"#REF!"}},{"$error":"#REF!"},{"$error":"#REF!"},{"$error":"#REF!"},{"v":-25.92465282950036,"d":"($25.92)"},{"v":-24.629785393537972,"d":"($24.63)"},{"v":-2.008125999999997,"d":"($2.01)"},{"$f":"'Dry Sorghum Sudangrass'!$D$9","v":{"v":0.4,"d":"$0.40"}},{"$f":"'Dry Sorghum Sudangrass'!$C$9","v":"lb"},{"v":400.8116320737509,"d":"400.8"},{"$f":"IF($U26=0, 0, IF('Dry Sorghum Sudangrass'!$E$9=0,0,L26/$U26/(1-'Dry Sorghum Sudangrass'!$E$9)))","v":{"v":427.9021843042461,"d":"427.9"}},{"$f":"IF($U26=0, 0, IF('Dry Sorghum Sudangrass'!$E$9=0,0,M26/$U26/('Dry Sorghum Sudangrass'!$E$9)))","v":{"v":351.2130757575757,"d":"351.2"}}]
[{"$f":"'Dry Sunflowers-Oilseed'!$A$3:$H$3","v":"Dryland Sunflowers-Oilseed "},{"$f":"'Dry Sunflowers-Oilseed'!F$12","v":{"v":165,"d":"$165.00"}},{"$f":"'Dry Sunflowers-Oilseed'!G$12","v":{"v":110.54999999999998,"d":"$110.55"}},{"$f":"'Dry Sunflowers-Oilseed'!H$12","v":{"v":54.45,"d":"$54.45"}},{"$f":"'Dry Sunflowers-Oilseed'!F$44","v":{"v":152.16315021861502,"d":"$152.16"}},{"$f":"'Dry Sunflowers-Oilseed'!G$44","v":{"v":126.02865285603801,"d":"$126.03"}},{"$f":"'Dry Sunflowers-Oilseed'!H$44","v":{"v":26.674335187500002,"d":"$26.67"}},{"v":12.836849781384984,"d":"$12.84"},{"v":-15.478652856038025,"d":"($15.48)"},{"v":27.7756648125,"d":"$27.78"},{"$f":"'Dry Sunflowers-Oilseed'!F$58","v":{"v":201.25315021861502,"d":"$201.25"}},{"$f":"'Dry Sunflowers-Oilseed'!G$58","v":{"v":148.618652856038,"d":"$148.62"}},{"$f":"'Dry Sunflowers-Oilseed'!H$58","v":{"v":53.174335187500006,"d":"$53.17"}},{"$f":"'Dry Sunflowers-Oilseed'!#REF!","v":{"$error":"#REF!"}},{"$error":"#REF!"},{"$error":"#REF!"},{"$error":"#REF!"},{"v":-36.25315021861502,"d":"($36.25)"},{"v":-38.06865285603803,"d":"($38.07)"},{"v":1.275664812499997,"d":"$1.28"},{"$f":"'Dry Sunflowers-Oilseed'!$D$9","v":{"v":16.5,"d":"$16.50"}},{"$f":"'Dry Sunflowers-Oilseed'!$C$9","v":"cwt"},{"v":12.19716061931,"d":"12.2"},{"$f":"IF($U27=0, 0, IF('Dry Sunflowers-Oilseed'!$E$9=0,0,L27/$U27/(1-'Dry Sunflowers-Oilseed'!$E$9)))","v":{"v":13.443568779379287,"d":"13.4"}},{"$f":"IF($U27=0, 0, IF('Dry Sunflowers-Oilseed'!$E$9=0,0,M27/$U27/('Dry Sunflowers-Oilseed'!$E$9)))","v":{"v":9.76571812442608,"d":"9.8"}}]
[{"$f":"'Dry Wheat'!$A$3:$H$3","v":"Dryland Wheat"},{"$f":"'Dry Wheat'!F$13","v":{"v":108.2,"d":"$108.20"}},{"$f":"'Dry Wheat'!G$13","v":{"v":72.494,"d":"$72.49"}},{"$f":"'Dry Wheat'!H$13","v":{"v":35.706,"d":"$35.71"}},{"$f":"'Dry Wheat'!F$44","v":{"v":111.8527108352941,"d":"$111.85"}},{"$f":"'Dry Wheat'!G$44","v":{"v":98.76558870999999,"d":"$98.77"}},{"$f":"'Dry Wheat'!H$44","v":{"v":12.709125,"d":"$12.71"}},{"v":-3.6527108352941013,"d":"($3.65)"},{"v":-26.27158870999999,"d":"($26.27)"},{"v":22.996875000000003,"d":"$23.00"},{"$f":"'Dry Wheat'!F$58","v":{"v":165.0327108352941,"d":"$165.03"}},{"$f":"'Dry Wheat'!G$58","v":{"v":125.44558870999998,"d":"$125.45"}},{"$f":"'Dry Wheat'!H$58","v":{"v":39.209125,"d":"$39.21"}},{"$f":"'Dry Wheat'!#REF!","v":{"$error":"#REF!"}},{"$error":"#REF!"},{"$error":"#REF!"},{"$error":"#REF!"},{"v":-56.832710835294094,"d":"($56.83)"},{"v":-52.95158870999998,"d":"($52.95)"},{"v":-3.503124999999997,"d":"($3.50)"},{"$f":"'Dry Wheat'!$D$9","v":{"v":3.95,"d":"$3.95"}},{"$f":"'Dry Wheat'!$C$9","v":"bu"},{"$f":"IF($U28=0, 0, (K28-'Dry Wheat'!$F$10)/$U28)","v":{"v":34.38802805956813,"d":"34.4"}},{"$f":"IF($U28=0, 0, IF('Dry Wheat'!$E$9=0,0,(L28-'Dry Wheat'!$G$10)/$U28/(1-'Dry Wheat'!$E$9)))","v":{"v":40.0081574570187,"d":"40.0"}},{"$f":"IF($U28=0, 0, IF('Dry Wheat'!$E$9=0,0,(M28-'Dry Wheat'!$H$10)/$U28/('Dry Wheat'!$E$9)))","v":{"v":22.68747602608362,"d":"22.7"}}]
[{"$f":"'Dry Other Crop'!$A$3:$H$3","v":"Dryland Other Crop"},{"$f":"'Dry Other Crop'!F$12","v":{"v":0,"d":"$0.00"}},{"$f":"'Dry Other Crop'!G$12","v":{"v":0,"d":"$0.00"}},{"$f":"'Dry Other Crop'!H$12","v":{"v":0,"d":"$0.00"}},{"$f":"'Dry Other Crop'!F$44","v":{"v":0,"d":"$0.00"}},{"$f":"'Dry Other Crop'!G$44","v":{"v":0,"d":"$0.00"}},{"$f":"'Dry Other Crop'!H$44","v":{"v":0,"d":"$0.00"}},{"v":0,"d":"$0.00"},{"v":0,"d":"$0.00"},{"v":0,"d":"$0.00"},{"$f":"'Dry Other Crop'!F$58","v":{"v":0,"d":"$0.00"}},{"$f":"'Dry Other Crop'!G$58","v":{"v":0,"d":"$0.00"}},{"$f":"'Dry Other Crop'!H$58","v":{"v":0,"d":"$0.00"}},{"$f":"'Dry Other Crop'!#REF!","v":{"$error":"#REF!"}},{"$error":"#REF!"},{"$error":"#REF!"},{"$error":"#REF!"},{"v":0,"d":"$0.00"},{"v":0,"d":"$0.00"},{"v":0,"d":"$0.00"},{"$f":"'Dry Other Crop'!$D$9","v":{"v":0,"d":"$0.00"}},{"$f":"'Dry Other Crop'!$C$9","v":"unit"},{"$f":"IF($U29=0, 0, (K29-'Dry Other Crop'!$F$10)/$U29)","v":0},{"$f":"IF($U29=0, 0, IF('Dry Other Crop'!$E$9=0,0,(L29-'Dry Other Crop'!$G$10)/$U29/(1-'Dry Other Crop'!$E$9)))","v":0},{"$f":"IF($U29=0, 0, IF('Dry Other Crop'!$E$9=0,0,(M29-'Dry Other Crop'!$H$10)/$U29/('Dry Other Crop'!$E$9)))","v":0}]

{"sheet":"Irrigation Analysis","index":28,"n_rows":33,"n_cols":23,"rows_kept":33,"merged":[[2,1,2,5],[8,16,8,22]]}
[]
["Irrigation Analysis"]
["Farm Name","ABC Farm"]
["Total Well GPM to Pivot",500]
["Acres Available for Irrigation",120]
["Minimum Planting Circle Size","None"]
["Allowed Inches per Gross Acre",{"v":15,"d":"15.00"}]
["Gross Acres",160]
[{"$nulls":16},"Total ROVC at Various Irrigated and Dryland Combinations"]
["Commodity","Crop GPM \nper acre","Normal GPM/Acre by Crop","Limited Max Irr Acreage","Maximum Irr Acreage","Remaining Acres","ROVC/ Acre","ROVC/       Ac-In","ROVC (Irr. Land)",{"$f":"$A27","v":"Dryland Canola"},{"$f":"A28","v":"Dryland Cotton"},{"$f":"A29","v":"Dryland Sorghum"},{"$f":"A30","v":"Dryland Sorghum Sudangrass"},{"$f":"A31","v":"Dryland Sunflowers-Oilseed "},{"$f":"A32","v":"Dryland Wheat"},{"$f":"A33","v":"Dryland Other Crop"},"With Dryland Canola","With Dryland  Cotton","With Dryland Sorghum","With Dryland Sorg. Sundangrass","With Dryland Sunfl.-Oils.","With Dryland  Wheat","With Dryland Other Crop"]
[{"$f":"'Irr Alfalfa'!$A$3:$H$3","v":"Irrigated Alfalfa "},{"$f":"Alfalfa_GPM","v":{"v":8.000115962524307,"d":"8.0"}},"7 to 8",{"$f":"IF(Alfalfa_Inches=0,0,MIN(IF(B11=0,0,MIN($B$5,$B$4/B11)),$B$7*$B$8/Alfalfa_Inches))","v":{"v":62.4990940559108,"d":"62 "}},{"$f":"IF((D11)>$B$5,$B$5,IF($B$6=\"None\",(D11),FLOOR((D11),($B$5*$B$6))))","v":{"v":62.4990940559108,"d":"62"}},{"$f":"$B$5-E11","v":{"v":57.5009059440892,"d":"58"}},{"$f":"'Comparative Returns'!H7","v":{"v":271.08464078873544,"d":"$271.08"}},{"$f":"'Comparative Returns'!O7","v":{"v":11.29519336619731,"d":"$11.30"}},{"$f":"IF(SUBTOTAL(102,$G11)=1,G11*E11,\"-\")","v":{"v":16942.54446176797,"d":"$16,943"}},{"$f":"F11*$G$27","v":{"v":202.52328877325306,"d":"$203"}},{"$f":"F11*$G$28","v":{"v":1716.8360556596451,"d":"$1,717"}},{"$f":"F11*$G$29","v":{"v":-737.2652218334925,"d":"-$737"}},{"$f":"F11*$G$30","v":{"v":1409.0796627781526,"d":"$1,409"}},{"$f":"F11*$G$31","v":{"v":738.13049189782,"d":"$738"}},{"$f":"F11*$G$32","v":{"v":-210.0341821812016,"d":"-$210"}},{"$f":"F11*$G$33","v":{"v":0,"d":"$0"}},{"$f":"IF(SUBTOTAL(102,$G11,$G$27)=2,IF($I11=($I11+J11),\"-\",($I11+J11)),\"-\")","v":{"v":17145.067750541224,"d":"$17,145"}},{"$f":"IF(SUBTOTAL(102,$G11,$G$28)=2,IF($I11=($I11+K11),\"-\",($I11+K11)),\"-\")","v":{"v":18659.380517427617,"d":"$18,659"}},{"$f":"IF(SUBTOTAL(102,$G11,$G$29)=2,IF($I11=($I11+L11),\"-\",($I11+L11)),\"-\")","v":{"v":16205.279239934478,"d":"$16,205"}},{"$f":"IF(SUBTOTAL(102,$G11,$G$30)=2,IF($I11=($I11+M11),\"-\",($I11+M11)),\"-\")","v":{"v":18351.624124546124,"d":"$18,352"}},{"$f":"IF(SUBTOTAL(102,$G11,$G$31)=2,IF($I11=($I11+N11),\"-\",($I11+N11)),\"-\")","v":{"v":17680.67495366579,"d":"$17,681"}},{"$f":"IF(SUBTOTAL(102,$G11,$G$32)=2,IF($I11=($I11+O11),\"-\",($I11+O11)),\"-\")","v":{"v":16732.51027958677,"d":"$16,733"}},{"$f":"IF(SUBTOTAL(102,$G11,$G$33)=2,IF($I11=($I11+P11),\"-\",($I11+P11)),\"-\")","v":"-"}]
[{"$f":"'Irr Canola'!$A$3:$H$3","v":"Irrigated Canola"},{"$f":"Canola_GPM","v":{"v":2.000099703012304,"d":"2.0"}},"2 to 3.5",{"$f":"IF(Canola_Inches=0,0,MIN(IF(B12=0,0,MIN($B$5,$B$4/B12)),$B$7*$B$8/Canola_Inches))","v":{"v":120,"d":"120 "}},{"$f":"IF((D12)>$B$5,$B$5,IF($B$6=\"None\",(D12),FLOOR((D12),($B$5*$B$6))))","v":120},{"$f":"$B$5-E12","v":0},{"$f":"'Comparative Returns'!H8","v":{"v":21.52529496620076,"d":"$21.53"}},{"$f":"'Comparative Returns'!O8","v":{"v":2.152529496620076,"d":"$2.15"}},{"$f":"IF(SUBTOTAL(102,$G12)=1,G12*E12,\"-\")","v":{"v":2583.0353959440913,"d":"$2,583"}},{"v":0,"d":"$0"},{"v":0,"d":"$0"},{"v":0,"d":"$0"},{"v":0,"d":"$0"},{"v":0,"d":"$0"},{"v":0,"d":"$0"},{"v":0,"d":"$0"},"-","-","-","-","-","-","-"]
[{"$f":"'Irr Corn'!$A$3:$H$3","v":"Irrigated Corn"},{"$f":"Corn_GPM","v":{"v":6.0001833960081,"d":"6.0"}},"4.5 to 7",{"$f":"IF(Corn_Inches=0,0,MIN(IF(B13=0,0,MIN($B$5,$B$4/B13)),$B$7*$B$8/Corn_Inches))","v":{"v":83.33078624440849,"d":"83 "}},{"v":83.33078624440849,"d":"83"},{"v":36.669213755591514,"d":"37"},{"$f":"'Comparative Returns'!H9","v":{"v":215.49175698144927,"d":"$215.49"}},{"$f":"'Comparative Returns'!O9","v":{"v":9.795079862793148,"d":"$9.80"}},{"v":17957.09753845317,"d":"$17,957"},{"v":129.1522219446909,"d":"$129"},{"v":1094.8528075280108,"d":"$1,095"},{"v":-470.16539252900225,"d":"-$470"},{"v":898.5918135500312,"d":"$899"},{"v":470.71718858202416,"d":"$471"},{"v":-133.94203440676463,"d":"-$134"},{"v":0,"d":"$0"},{"v":18086.249760397863,"d":"$18,086"},{"v":19051.950345981182,"d":"$19,052"},{"v":17486.93214592417,"d":"$17,487"},{"v":18855.689352003203,"d":"$18,856"},{"v":18427.814727035195,"d":"$18,428"},{"v":17823.155504046405,"d":"$17,823"},"-"]
[{"$f":"'Irr Corn Silage'!$A$3:$H$3","v":"Irrigated Corn Silage"},{"$f":"Corn_Silage_GPM","v":{"v":5.99966274260261,"d":"6.0"}},"4.5 to 7",{"$f":"IF(Corn_Silage_Inches=0,0,MIN(IF(B14=0,0,MIN($B$5,$B$4/B14)),$B$7*$B$8/Corn_Silage_Inches))","v":{"v":83.33801772716038,"d":"83 "}},{"v":83.33801772716038,"d":"83"},{"v":36.66198227283962,"d":"37"},{"$f":"'Comparative Returns'!H10","v":{"v":142.42559753392902,"d":"$142.43"}},{"$f":"'Comparative Returns'!O10","v":{"v":7.121279876696451,"d":"$7.12"}},{"v":11869.466972083987,"d":"$11,869"},{"v":129.1267520212945,"d":"$129"},{"v":1094.6368931850889,"d":"$1,095"},{"v":-470.0726718901232,"d":"-$470"},{"v":898.4146035546387,"d":"$898"},{"v":470.6243591242415,"d":"$471"},{"v":-133.91561989136156,"d":"-$134"},{"v":0,"d":"$0"},{"v":11998.593724105282,"d":"$11,999"},{"v":12964.103865269075,"d":"$12,964"},{"v":11399.394300193864,"d":"$11,399"},{"v":12767.881575638625,"d":"$12,768"},{"v":12340.091331208228,"d":"$12,340"},{"v":11735.551352192624,"d":"$11,736"},"-"]
[{"$f":"'Irr Cotton'!$A$3:$H$3","v":"Irrigated Cotton"},{"$f":"Cotton_GPM","v":{"v":2.999910910778205,"d":"3.0"}},"2 to 3.5",{"$f":"IF(Cotton_Inches=0,0,MIN(IF(B15=0,0,MIN($B$5,$B$4/B15)),$B$7*$B$8/Cotton_Inches))","v":{"v":120,"d":"120 "}},120,0,{"$f":"'Comparative Returns'!H11","v":{"v":352.95468965536975,"d":"$352.95"}},{"$f":"'Comparative Returns'!O11","v":{"v":29.412890804614147,"d":"$29.41"}},{"v":42354.56275864437,"d":"$42,355"},{"v":0,"d":"$0"},{"v":0,"d":"$0"},{"v":0,"d":"$0"},{"v":0,"d":"$0"},{"v":0,"d":"$0"},{"v":0,"d":"$0"},{"v":0,"d":"$0"},"-","-","-","-","-","-","-"]
[{"$f":"'Irr Peanuts'!$A$3:$H$3","v":"Irrigated Peanuts"},{"$f":"Peanuts_GPM","v":{"v":4.999946212121212,"d":"5.0"}},"4.5 to 6",{"$f":"IF(Peanuts_Inches=0,0,MIN(IF(B16=0,0,MIN($B$5,$B$4/B16)),$B$7*$B$8/Peanuts_Inches))","v":{"v":100.00107576914843,"d":"100 "}},{"v":100.00107576914843,"d":"100"},{"v":19.99892423085157,"d":"20"},{"$f":"'Comparative Returns'!H12","v":{"v":203.42781204141727,"d":"$203.43"}},{"$f":"'Comparative Returns'!O12","v":{"v":9.687038668638918,"d":"$9.69"}},{"v":20343.000045505854,"d":"$20,343"},{"v":70.43798424841175,"d":"$70"},{"v":597.1188389156288,"d":"$597"},{"v":-256.42224356998423,"d":"-$256"},{"v":490.0805813135354,"d":"$490"},{"v":256.72318614074186,"d":"$257"},{"v":-73.05028723225729,"d":"-$73"},{"v":0,"d":"$0"},{"v":20413.438029754267,"d":"$20,413"},{"v":20940.118884421485,"d":"$20,940"},{"v":20086.57780193587,"d":"$20,087"},{"v":20833.08062681939,"d":"$20,833"},{"v":20599.723231646596,"d":"$20,600"},{"v":20269.949758273597,"d":"$20,270"},"-"]
[{"$f":"'Irr Sorghum'!$A$3:$H$3","v":"Irrigated Sorghum"},{"$f":"Sorghum_GPM","v":{"v":2.4999257589818376,"d":"2.5"}},"3.5 to 4.5",{"$f":"IF(Sorghum_Inches=0,0,MIN(IF(B17=0,0,MIN($B$5,$B$4/B17)),$B$7*$B$8/Sorghum_Inches))","v":{"v":120,"d":"120 "}},120,0,{"$f":"'Comparative Returns'!H13","v":{"v":7.168982144150732,"d":"$7.17"}},{"$f":"'Comparative Returns'!O13","v":{"v":0.7168982144150732,"d":"$0.72"}},{"v":860.2778572980878,"d":"$860"},{"v":0,"d":"$0"},{"v":0,"d":"$0"},{"v":0,"d":"$0"},{"v":0,"d":"$0"},{"v":0,"d":"$0"},{"v":0,"d":"$0"},{"v":0,"d":"$0"},"-","-","-","-","-","-","-"]
[{"$f":"'Irr Sorghum Seed'!$A$3:$H$3","v":"Irrigated Sorghum Seed "},{"$f":"Sorghum_Seed_GPM","v":{"v":3.076800326330818,"d":"3.1"}},"3.5 to 4.5",{"$f":"IF(Sorghum_Seed_Inches=0,0,MIN(IF(B18=0,0,MIN($B$5,$B$4/B18)),$B$7*$B$8/Sorghum_Seed_Inches))","v":{"v":120,"d":"120 "}},120,0,{"$f":"'Comparative Returns'!H14","v":{"v":383.28373725230756,"d":"$383.28"}},{"$f":"'Comparative Returns'!O14","v":{"v":23.955233578269223,"d":"$23.96"}},{"v":45994.04847027691,"d":"$45,994"},{"v":0,"d":"$0"},{"v":0,"d":"$0"},{"v":0,"d":"$0"},{"v":0,"d":"$0"},{"v":0,"d":"$0"},{"v":0,"d":"$0"},{"v":0,"d":"$0"},"-","-","-","-","-","-","-"]
[{"$f":"'Irr Sorghum Silage'!$A$3:$H$3","v":"Irrigated Sorghum Silage"},{"$f":"Sorghum_Silage_GPM","v":{"v":3.5000031410622503,"d":"3.5"}},"3.5 to 4.5",{"$f":"IF(Sorghum_Silage_Inches=0,0,MIN(IF(B19=0,0,MIN($B$5,$B$4/B19)),$B$7*$B$8/Sorghum_Silage_Inches))","v":{"v":120,"d":"120 "}},120,0,{"$f":"'Comparative Returns'!H15","v":{"v":156.09795838623546,"d":"$156.10"}},{"$f":"'Comparative Returns'!O15","v":{"v":12.007535260479651,"d":"$12.01"}},{"v":18731.755006348256,"d":"$18,732"},{"v":0,"d":"$0"},{"v":0,"d":"$0"},{"v":0,"d":"$0"},{"v":0,"d":"$0"},{"v":0,"d":"$0"},{"v":0,"d":"$0"},{"v":0,"d":"$0"},"-","-","-","-","-","-","-"]
[{"$f":"'Irr Sorghum Sudangrass'!$A$3:$H$3","v":"Irrigated Sorghum Sudangrass"},{"$f":"Sorghum_Sudan_GPM","v":{"v":3.4999476180655806,"d":"3.5"}},"3.5 to 4.5",{"$f":"IF(Sorghum_Sudan_Inches=0,0,MIN(IF(B20=0,0,MIN($B$5,$B$4/B20)),$B$7*$B$8/Sorghum_Sudan_Inches))","v":{"v":120,"d":"120 "}},120,0,{"$f":"'Comparative Returns'!H16","v":{"v":65.82199616562107,"d":"$65.82"}},{"$f":"'Comparative Returns'!O16","v":{"v":7.313555129513452,"d":"$7.31"}},{"v":7898.639539874529,"d":"$7,899"},{"v":0,"d":"$0"},{"v":0,"d":"$0"},{"v":0,"d":"$0"},{"v":0,"d":"$0"},{"v":0,"d":"$0"},{"v":0,"d":"$0"},{"v":0,"d":"$0"},"-","-","-","-","-","-","-"]
[{"$f":"'Irr Soybeans'!$A$3:$H$3","v":"Irrigated Soybeans"},{"$f":"Soybeans_GPM","v":{"v":3.8891744254566887,"d":"3.9"}},"4.5 to 6",{"$f":"IF(Soybeans_Inches=0,0,MIN(IF(B21=0,0,MIN($B$5,$B$4/B21)),$B$7*$B$8/Soybeans_Inches))","v":{"v":120,"d":"120 "}},120,0,{"$f":"'Comparative Returns'!H17","v":{"v":136.72160952000002,"d":"$136.72"}},{"$f":"'Comparative Returns'!O17","v":{"v":9.765829251428572,"d":"$9.77"}},{"v":16406.5931424,"d":"$16,407"},{"v":0,"d":"$0"},{"v":0,"d":"$0"},{"v":0,"d":"$0"},{"v":0,"d":"$0"},{"v":0,"d":"$0"},{"v":0,"d":"$0"},{"v":0,"d":"$0"},"-","-","-","-","-","-","-"]
[{"$f":"'Irr Sunflowers-Confection'!$A$3:$H$3","v":"Irrigated Sunflowers-Confectionary "},{"$f":"Sunflowers_Conf_GPM","v":{"v":1.999978484848485,"d":"2.0"}},"2 to 3.5",{"$f":"IF(Sunflowers_Conf_Inches=0,0,MIN(IF(B22=0,0,MIN($B$5,$B$4/B22)),$B$7*$B$8/Sunflowers_Conf_Inches))","v":{"v":120,"d":"120 "}},120,0,{"$f":"'Comparative Returns'!H18","v":{"v":93.1268918500001,"d":"$93.13"}},{"$f":"'Comparative Returns'!O18","v":{"v":13.303841692857159,"d":"$13.30"}},{"v":11175.227022000014,"d":"$11,175"},{"v":0,"d":"$0"},{"v":0,"d":"$0"},{"v":0,"d":"$0"},{"v":0,"d":"$0"},{"v":0,"d":"$0"},{"v":0,"d":"$0"},{"v":0,"d":"$0"},"-","-","-","-","-","-","-"]
[{"$f":"'Irr Sunflowers-Oilseed'!$A$3:$H$3","v":"Irrigated Sunflowers-Oilseed "},{"$f":"Sunflowers_Oil_GPM","v":{"v":1.999978484848485,"d":"2.0"}},"2 to 3.5",{"$f":"IF(Sunflowers_Oil_Inches=0,0,MIN(IF(B23=0,0,MIN($B$5,$B$4/B23)),$B$7*$B$8/Sunflowers_Oil_Inches))","v":{"v":120,"d":"120 "}},120,0,{"$f":"'Comparative Returns'!H19","v":{"v":46.12446327857151,"d":"$46.12"}},{"$f":"'Comparative Returns'!O19","v":{"v":6.58920903979593,"d":"$6.59"}},{"v":5534.935593428581,"d":"$5,535"},{"v":0,"d":"$0"},{"v":0,"d":"$0"},{"v":0,"d":"$0"},{"v":0,"d":"$0"},{"v":0,"d":"$0"},{"v":0,"d":"$0"},{"v":0,"d":"$0"},"-","-","-","-","-","-","-"]
[{"$f":"'Irr Triticale Silage'!$A$3:$H$3","v":"Irrigated Triticale Silage"},{"$f":"Triticale_Silage_GPM","v":{"v":2.692310108509423,"d":"2.7"}},"3.5 to 4.5",{"$f":"IF(Triticale_Silage_Inches=0,0,MIN(IF(B24=0,0,MIN($B$5,$B$4/B24)),$B$7*$B$8/Triticale_Silage_Inches))","v":{"v":120,"d":"120 "}},{"$f":"IF((D24)>$B$5,$B$5,IF($B$6=\"None\",(D24),FLOOR((D24),($B$5*$B$6))))","v":120},{"$f":"$B$5-E24","v":0},{"$f":"'Comparative Returns'!H20","v":{"v":2.092564077058853,"d":"$2.09"}},{"$f":"'Comparative Returns'!O20","v":{"v":0.04315454891851625,"d":"$0.04"}},{"$f":"IF(SUBTOTAL(102,$G24)=1,G24*E24,\"-\")","v":{"v":251.10768924706235,"d":"$251"}},{"$f":"F24*$G$27","v":{"v":0,"d":"$0"}},{"$f":"F24*$G$28","v":{"v":0,"d":"$0"}},{"$f":"F24*$G$29","v":{"v":0,"d":"$0"}},{"$f":"F24*$G$30","v":{"v":0,"d":"$0"}},{"$f":"F24*$G$31","v":{"v":0,"d":"$0"}},{"$f":"F24*$G$32","v":{"v":0,"d":"$0"}},{"$f":"F24*$G$33","v":{"v":0,"d":"$0"}},"-","-","-","-","-","-","-"]
[{"$f":"'Irr Wheat'!$A$3:$H$3","v":"Irrigated Wheat"},{"$f":"Wheat_GPM","v":{"v":2.6667996040164055,"d":"2.7"}},"3.5 to 4.5",{"$f":"IF(Wheat_Inches=0,0,MIN(IF(B25=0,0,MIN($B$5,$B$4/B25)),$B$7*$B$8/Wheat_Inches))","v":{"v":120,"d":"120 "}},120,0,{"$f":"'Comparative Returns'!H21","v":{"v":-28.688162337666625,"d":"-$28.69"}},{"$f":"'Comparative Returns'!O21","v":{"v":-2.8688162337666627,"d":"-$2.87"}},{"v":-3442.579480519995,"d":"-$3,443"},{"$f":"F25*$G$27","v":{"v":0,"d":"$0"}},{"$f":"F25*$G$28","v":{"v":0,"d":"$0"}},{"$f":"F25*$G$29","v":{"v":0,"d":"$0"}},{"$f":"F25*$G$30","v":{"v":0,"d":"$0"}},{"$f":"F25*$G$31","v":{"v":0,"d":"$0"}},{"$f":"F25*$G$32","v":{"v":0,"d":"$0"}},{"$f":"F25*$G$33","v":{"v":0,"d":"$0"}},"-","-","-","-","-","-","-"]
[{"$f":"'Irr Other Crop'!$A$3:$H$3","v":"Irrigated Other Crop"},{"$f":"Other_GPM","v":{"v":0,"d":"0.0"}},"2 to 8",{"$f":"IF(Other_Inches=0,0,MIN(IF(B26=0,0,MIN($B$5,$B$4/B26)),$B$7*$B$8/Other_Inches))","v":{"v":0,"d":"0 "}},0,120,{"$f":"'Comparative Returns'!H22","v":{"v":0,"d":"$0.00"}},{"$f":"'Comparative Returns'!O22","v":"-"},{"v":0,"d":"$0"},{"$f":"F26*$G$27","v":{"v":422.65063921638216,"d":"$423"}},{"$f":"F26*$G$28","v":{"v":3582.905752467284,"d":"$3,583"}},{"$f":"F26*$G$29","v":{"v":-1538.616221213008,"d":"-$1,539"}},{"$f":"F26*$G$30","v":{"v":2940.6416604599576,"d":"$2,941"}},{"$f":"F26*$G$31","v":{"v":1540.421973766198,"d":"$1,540"}},{"$f":"F26*$G$32","v":{"v":-438.32530023529216,"d":"-$438"}},{"$f":"F26*$G$33","v":{"v":0,"d":"$0"}},{"v":422.65063921638216,"d":"$423"},{"v":3582.905752467284,"d":"$3,583"},{"v":-1538.616221213008,"d":"-$1,539"},{"v":2940.6416604599576,"d":"$2,941"},{"v":1540.421973766198,"d":"$1,540"},{"v":-438.32530023529216,"d":"-$438"},"-"]
[{"$f":"'Dry Canola'!$A$3:$H$3","v":"Dryland Canola"},"-",null,null,"-","-",{"$f":"'Comparative Returns'!H23","v":{"v":3.522088660136518,"d":"$3.52"}},"-"]
[{"$f":"'Dry Cotton'!$A$3:$H$3","v":"Dryland Cotton"},"-","Min Planting Circle Size",null,"-","-",{"$f":"'Comparative Returns'!H24","v":{"v":29.857547937227366,"d":"$29.86"}},"-"]
[{"$f":"'Dry Sorghum'!$A$3:$H$3","v":"Dryland Sorghum"},"-","None",null,"-","-",{"$f":"'Comparative Returns'!H25","v":{"v":-12.821801843441733,"d":"-$12.82"}},"-"]
[{"$f":"'Dry Sorghum Sudangrass'!$A$3:$H$3","v":"Dryland Sorghum Sudangrass"},"-",0.25,null,"-","-",{"$f":"'Comparative Returns'!H26","v":{"v":24.505347170499647,"d":"$24.51"}},"-"]
[{"$f":"'Dry Sunflowers-Oilseed'!$A$3:$H$3","v":"Dryland Sunflowers-Oilseed "},"-",{"$f":"1/3","v":0.3333333333333333},null,"-","-",{"$f":"'Comparative Returns'!H27","v":{"v":12.836849781384984,"d":"$12.84"}},"-"]
[{"$f":"'Dry Wheat'!$A$3:$H$3","v":"Dryland Wheat"},"-",0.5,null,"-","-",{"$f":"'Comparative Returns'!H28","v":{"v":-3.6527108352941013,"d":"-$3.65"}},"-"]
[{"$f":"'Dry Other Crop'!$A$3:$H$3","v":"Dryland Other Crop"},"-",null,null,"-","-",{"$f":"'Comparative Returns'!H29","v":{"v":0,"d":"$0.00"}},"-"]

{"sheet":"Graphs","index":29,"n_rows":2,"n_cols":1,"rows_kept":2}
[]
["Irrigation Analysis Graphs"]